Wed Jul 17 00:00:05 2019

bin/pencil-test --use-pc_auto-test --auto-test-options='--max-level=3,--config-files=GNU-GCC_MPI+GNU-GCC_debug,--auto-clean' --pencil-home='/home/pencil/daily-test' --nice=15 --short --local --html

Lorraine:


daily-test/samples/no-modules: (1/71)
    Compiling..            [double]           ok        00:08
    Starting..                                ok        00:00
    Running..                                 ok        00:00
    Validating results..                      ok      
    Time used:                                        00:08 = 00:08 + 00:00

daily-test/samples/most-modules: (2/71)
    Compiling..                               ok        00:03
    Starting..                                ok        00:01
    Running..                                 ok        00:17
    Validating results..                      ok      
    Time used:                                        00:22 = 00:03 + 00:19

daily-test/samples/backwards-compatible: (3/71)
    Compiling..                               ok        00:02
    Starting..                                ok        00:00
    Running..                                 ok        00:00
    Validating results..                      ok      
    Time used:                                        00:03 = 00:02 + 00:00

daily-test/samples/1d-tests/implicit_diffusion: (4/71)
    Compiling..                               ok        00:02
    Starting..                                ok        00:00
    Running..                                 ok        00:00
    Validating results..                      ok      
    Time used:                                        00:03 = 00:02 + 00:00

daily-test/samples/2d-tests/chemistry_GrayScott: (5/71)
    Compiling..                               ok        00:02
    Starting..                                ok        00:00
    Running..                                 ok        00:06
    Validating results..                      ok      
    Time used:                                        00:09 = 00:02 + 00:06

daily-test/samples/2d-tests/shearwave-dust-par: (6/71)
    Compiling..                               ok        00:02
    Starting..                                ok        00:01
    Running..                                 ok        00:19
    Validating results..                      ok      
    Time used:                                        00:24 = 00:02 + 00:21

daily-test/samples/dust-vortex: (7/71)
    Compiling..                               ok        00:02
    Starting..                                ok        00:00
    Running..                                 ok        00:07
    Validating results..                      ok      
    Time used:                                        00:10 = 00:02 + 00:07

daily-test/samples/damped_alfven_waves: (8/71)
    Compiling..                               ok        00:03
    Starting..                                ok        00:01
    Running..                                 ok        01:02
    Validating results..                      ok      
    Time used:                                        01:07 = 00:03 + 01:04

daily-test/samples/corona: (9/71)
    Compiling..                               ok        00:02
    Starting..                                ok        00:02
    Running..                                 ok        02:36
    Validating results..                      ok      
    Time used:                                        02:42 = 00:02 + 02:39

daily-test/samples/0d-tests/heating_ionize: (10/71)
    Compiling..            [double]           ok        00:02
    Starting..                                ok        00:00
    Running..                                 ok        00:06
    Validating results..                      ok      
    Time used:                                        00:10 = 00:02 + 00:07

daily-test/samples/0d-tests/heating_noionize: (11/71)
    Compiling..                               ok        00:57
    Starting..                                ok        00:00
    Running..                                 ok        00:00
    Validating results..                      ok      
    Time used:                                        00:57 = 00:57 + 00:00

daily-test/samples/1d-tests/H2_flamespeed: (12/71)
    Compiling..                               ok        00:03
    Starting..                                ok        00:00
    Running..                                 ok        00:05
    Validating results..                      ok      
    Time used:                                        00:08 = 00:03 + 00:05

daily-test/samples/chiral-diffusion: (13/71)
    Compiling..                               ok        00:49
    Starting..                                ok        00:00
    Running..                                 ok        00:00
    Validating results..                      ok      
    Time used:                                        00:50 = 00:49 + 00:00

daily-test/samples/cosmicray: (14/71)
    Compiling..                               ok        00:58
    Starting..                                ok        00:00
    Running..                                 ok        00:00
    Validating results..                      ok      
    Time used:                                        00:59 = 00:58 + 00:00

daily-test/samples/1d-tests/sod_10: (15/71)
    Compiling..                               ok        01:00
    Starting..                                ok        00:00
    Running..                                 ok        00:01
    Validating results..                      ok      
    Time used:                                        01:01 = 01:00 + 00:01

daily-test/samples/1d-tests/ambipolar_diffusion: (16/71)
    Compiling..                               ok        00:03
    Starting..                                ok        00:00
    Running..                                 ok        00:10
    Validating results..                      ok      
    Time used:                                        00:13 = 00:03 + 00:10

daily-test/samples/GravitationalWaves: (17/71)
    Compiling..                               ok        01:24
    Starting..                                ok        00:01
    Running..                                 ok        00:04
    Validating results..                      ok      
    Time used:                                        01:30 = 01:24 + 00:05

daily-test/samples/polymer/forced_3dturbulence: (18/71)
    Compiling..                               ok        01:19
    Starting..                                ok        00:00
    Running..                                 ok        00:16
    Validating results..                      ok      
    Time used:                                        01:36 = 01:19 + 00:17

daily-test/samples/testfield_z: (19/71)
    Compiling..                               ok        01:22
    Starting..                                ok        00:00
    Running..                                 ok        00:29
    Validating results..                      ok      
    Time used:                                        01:52 = 01:22 + 00:29

daily-test/samples/random_uu_particles: (20/71)
    Compiling..                               ok        00:02
    Starting..                                ok        00:01
    Running..                                 ok        02:08
    Validating results..                      ok      
    Time used:                                        02:12 = 00:02 + 02:09

daily-test/samples/1d-tests/solar-atmosphere-temperature: (21/71)
    Compiling..            [double]           ok        00:02
    Starting..                                ok        00:00
    Running..                                 ok        00:18
    Validating results..                      ok      
    Time used:                                        00:21 = 00:02 + 00:19

daily-test/samples/kin-dynamo: (22/71)
    Compiling..                               ok        00:58
    Starting..                                ok        00:00
    Running..                                 ok        00:18
    Validating results..                      ok      
    Time used:                                        01:16 = 00:58 + 00:18

daily-test/samples/meissner: (23/71)
    Compiling..            [double]           ok        00:02
    Starting..                                ok        00:00
    Running..                                 ok        00:32
    Validating results..                      ok      
    Time used:                                        00:35 = 00:02 + 00:32

daily-test/samples/conv-slab-noequi: (24/71)
    Compiling..                               ok        01:22
    Starting..                                ok        00:00
    Running..                                 ok        00:47
    Validating results..                      ok      
    Time used:                                        02:09 = 01:22 + 00:47

daily-test/samples/2d-tests/selfgravitating-shearwave: (25/71)
    Compiling..                               ok        00:03
    Starting..                                ok        00:01
    Running..                                 ok        00:11
    Validating results..                      ok      
    Time used:                                        00:16 = 00:03 + 00:13

daily-test/samples/2d-tests/streaming_instability: (26/71)
    Compiling..                               ok        00:02
    Starting..                                ok        00:01
    Running..                                 ok        01:05
    Validating results..                      ok      
    Time used:                                        01:10 = 00:02 + 01:07

daily-test/samples/2d-tests/globaldisc: (27/71)
    Compiling..                               ok        00:02
    Starting..                                ok        00:00
    Running..                                 ok        00:44
    Validating results..                      ok      
    Time used:                                        00:47 = 00:02 + 00:45

daily-test/samples/2d-tests/cylindrical_gdisk: (28/71)
    Compiling..                               ok        00:02
    Starting..                                ok        00:00
    Running..                                 ok        00:00
    Validating results..                      ok      
    Time used:                                        00:03 = 00:02 + 00:00

daily-test/samples/2d-tests/planet-disk-fargo: (29/71)
    Compiling..                               ok        00:02
    Starting..                                ok        00:01
    Running..                                 ok        00:02
    Validating results..                      ok      
    Time used:                                        00:07 = 00:02 + 00:04

daily-test/samples/spherical-globaldisk: (30/71)
    Compiling..                               ok        00:02
    Starting..                                ok        00:01
    Running..                                 ok        00:02
    Validating results..                      ok      
    Time used:                                        00:06 = 00:02 + 00:03

daily-test/samples/spherical-globaldisk-mhd: (31/71)
    Compiling..                               ok        00:02
    Starting..                                ok        00:01
    Running..                                 ok        00:06
    Validating results..                      ok      
    Time used:                                        00:10 = 00:02 + 00:07

daily-test/samples/spherical-gdisk-planet-thermo: (32/71)
    Compiling..                               ok        00:02
    Starting..                                ok        00:01
    Running..                                 ok        00:48
    Validating results..                      ok      
    Time used:                                        00:52 = 00:02 + 00:49

daily-test/samples/0d-tests/solar_system: (33/71)
    Compiling..                               ok        00:02
    Starting..                                ok        00:01
    Running..                                 ok        00:02
    Validating results..                      ok      
    Time used:                                        00:06 = 00:02 + 00:03

daily-test/samples/mdwarf: (34/71)
    Compiling..                               ok        01:31
    Starting..                                ok        00:00
    Running..                                 ok        00:18
    Validating results..                      ok      
    Time used:                                        01:50 = 01:31 + 00:18

daily-test/samples/sedimentation: (35/71)
    Compiling..                               ok        00:03
    Starting..                                ok        00:01
    Running..                                 ok        00:22
    Validating results..                      ok      
    Time used:                                        00:27 = 00:03 + 00:24

daily-test/samples/MRI-turbulence_hyper: (36/71)
    Compiling..            [double]           ok        00:03
    Starting..                                ok        00:01
    Running..                                 ok        01:00
    Validating results..                      ok      
    Time used:                                        01:05 = 00:03 + 01:02

daily-test/samples/dust_turb_globaldisk: (37/71)
    Compiling..                               ok        00:03
    Starting..                                ok        00:01
    Running..                                 ok        03:41
    Validating results..                      ok      
    Time used:                                        03:46 = 00:03 + 03:43

daily-test/samples/geodynamo: (38/71)
    Compiling..                               ok        01:36
    Starting..                                ok        00:01
    Running..                                 ok        00:37
    Validating results..                      ok      
    Time used:                                        02:15 = 01:36 + 00:38

daily-test/samples/2d-tests/cylinder_deposition: (39/71)
    Compiling..                               ok        00:02
    Starting..                                ok        00:00
    Running..                                 ok        00:10
    Validating results..                      ok      
    Time used:                                        00:14 = 00:02 + 00:11

daily-test/samples/2d-tests/selfgravdisk-deadzone-dust: (40/71)
    Compiling..                               ok        00:02
    Starting..                                ok        00:01
    Running..                                 ok        00:27
    Validating results..                      ok      
    Time used:                                        00:32 = 00:02 + 00:29

daily-test/samples/2d-tests/spherical_viscous_ring: (41/71)
    Compiling..                               ok        01:01
    Starting..                                ok        00:00
    Running..                                 ok        00:03
    Validating results..                      ok      
    Time used:                                        01:05 = 01:01 + 00:03

daily-test/samples/2d-tests/field-loop-fargo: (42/71)
    Compiling..                               ok        00:02
    Starting..                                ok        00:01
    Running..                                 ok        00:09
    Validating results..                      ok      
    Time used:                                        00:14 = 00:02 + 00:11

daily-test/samples/baroclinic: (43/71)
    Compiling..                               ok        00:02
    Starting..                                ok        00:01
    Running..                                 ok        01:23
    Validating results..                      ok      
    Time used:                                        01:28 = 00:02 + 01:25

daily-test/samples/1d-tests/sedimentation-noneq-blocks: (44/71)
    Compiling..                               ok        00:02
    Starting..                                ok        00:01
    Running..                                 ok        00:05
    Validating results..                      ok      
    Time used:                                        00:09 = 00:02 + 00:06

daily-test/samples/1d-tests/alphadisk: (45/71)
    Compiling..                               ok        00:03
    Starting..                                ok        00:03
    Running..                                 ok        00:09
    Validating results..                      ok      
    Time used:                                        00:16 = 00:03 + 00:13

daily-test/samples/implicit_resistivity: (46/71)
    Compiling..                               ok        00:02
    Starting..                                ok        00:00
    Running..                                 ok        00:19
    Validating results..                      ok      
    Time used:                                        00:22 = 00:02 + 00:19

daily-test/samples/debris-photoelectric-fluid: (47/71)
    Compiling..                               ok        00:02
    Starting..                                ok        00:00
    Running..                                 ok        00:10
    Validating results..                      ok      
    Time used:                                        00:13 = 00:02 + 00:10

daily-test/samples/2d-tests/debris-photoeletric-streaming: (48/71)
    Compiling..                               ok        00:02
    Starting..                                ok        00:01
    Running..                                 ok        00:16
    Validating results..                      ok      
    Time used:                                        00:20 = 00:02 + 00:17

daily-test/samples/2d-tests/Kelvin-Helmholtz: (49/71)
    Compiling..                               ok        00:02
    Starting..                                ok        00:01
    Running..                                 ok        00:01
    Validating results..                      ok      
    Time used:                                        00:06 = 00:02 + 00:03

daily-test/samples/2d-tests/selfgravdisk-planet-dust: (50/71)
    Compiling..                               ok        00:02
    Starting..                                ok        00:01
    Running..                                 ok        00:27
    Validating results..                      ok      
    Time used:                                        00:31 = 00:02 + 00:28

daily-test/samples/cylindrical-globaldisk-dzone: (51/71)
    Compiling..                               ok        00:03
    Starting..                                ok        00:01
    Running..                                 ok        00:11
    Validating results..                      ok      
    Time used:                                        00:15 = 00:03 + 00:12

daily-test/samples/2d-tests/selfgravdisk-logspirals: (52/71)
    Compiling..                               ok        00:03
    Starting..                                ok        00:00
    Running..                                 ok        00:03
    Validating results..                      ok      
    Time used:                                        00:06 = 00:03 + 00:03

daily-test/samples/2d-tests/turbulent_potential: (53/71)
    Compiling..                               ok        00:02
    Starting..                                ok        00:01
    Running..                                 ok        00:10
    Validating results..                      ok      
    Time used:                                        00:14 = 00:02 + 00:11

daily-test/samples/2d-tests/WhiteDwarfDisk: (54/71)
    Compiling..                               ok        00:03
    Starting..                                ok        00:01
    Running..                                 ok        00:04
    Validating results..                      ok      
    Time used:                                        00:09 = 00:03 + 00:06

daily-test/samples/0d-tests/heating_ionize_planck: (55/71)
    Compiling..            [double]           ok        00:02
    Starting..                                ok        00:00
    Running..                                 ok        00:00
    Validating results..                      ok      
    Time used:                                        00:03 = 00:02 + 00:00

daily-test/samples/1d-tests/jeans-drag-dustpar-x: (56/71)
    Compiling..                               ok        00:02
    Starting..                                ok        00:00
    Running..                                 ok        00:00
    Validating results..                      ok      
    Time used:                                        00:03 = 00:02 + 00:00

daily-test/samples/1d-tests/jeans-x: (57/71)
    Compiling..                               ok        01:03
    Starting..                                ok        00:00
    Running..                                 ok        00:00
    Validating results..                      ok      
    Time used:                                        01:04 = 01:03 + 00:00

daily-test/samples/1d-tests/sod_10s: (58/71)
    Compiling..                               ok        01:01
    Starting..                                ok        00:00
    Running..                                 ok        00:01
    Validating results..                      ok      
    Time used:                                        01:03 = 01:01 + 00:01

daily-test/samples/1d-tests/toomre-x: (59/71)
    Compiling..                               ok        00:03
    Starting..                                ok        00:00
    Running..                                 ok        00:00
    Validating results..                      ok      
    Time used:                                        00:03 = 00:03 + 00:00

daily-test/samples/2d-tests/bubble: (60/71)
    Compiling..                               ok        01:04
    Starting..                                ok        00:00
    Running..                                 ok        00:01
    Validating results..                      ok      
    Time used:                                        01:05 = 01:04 + 00:01

daily-test/samples/2d-tests/conv-slab-MLT: (61/71)
    Compiling..                               ok        01:02
    Starting..                                ok        00:00
    Running..                                 ok        00:01
    Validating results..                      ok      
    Time used:                                        01:04 = 01:02 + 00:01

daily-test/samples/2d-tests/2d_methane_flame: (62/71)
    Compiling..                               ok        00:02
    Starting..                                ok        00:04
    Running..                                 ok        02:31
    Validating results..                      ok      
    Time used:                                        02:38 = 00:02 + 02:35

daily-test/samples/2d-tests/boussinesq_convection: (63/71)
    Compiling..                               not ok:   00:56
Running make '-j' 'FFLAGS_DOUBLE=-fdefault-real-8 -fdefault-double-8' 'CFLAGS_DOUBLE=-DDOUBLE_PRECISION' 'LD_MPI=' 'CFLAGS_FFTW3=' 'FFLAGS_FFTW3=' 'LD_FFTW3=' 'CFLAGS_FFTW2=' 'FFLAGS_FFTW2=' 'LD_FFTW2=' 'FC=mpif90' 'F77=mpif77' 'FFLAGS=-O -O0 -Wall -finit-real=NaN -finit-integer=-2147483648 -g -fbacktrace -fimplicit-none -fcheck=all -ffpe-trap=invalid,zero,overflow' 'LDFLAGS_HELPER=-dynamic' 'FSTD_95=-std=f95' 'FSTD_2003=-std=f2003' 'CC=mpicc' 'CFLAGS=-DFUNDERSC=1' 'default_to_be'
MAKING src/Makefile.inc
precision-check: No such file src/.current-precision -- creating new one at ./src/scripts/precision-check line 36.
touch src/.build-history
echo "@"`hostname` "("`date`")" >> src/.build-history
( cd src && \
	  echo "===== " make FROM_PARENT=src/ -f Makefile.src code "====="; \
	  make FROM_PARENT=src/ -f Makefile.src default_to_be \
	)
=====  make FROM_PARENT=src/ -f Makefile.src code =====
make[1]: Entering directory `/home/pencil/daily-test/samples/2d-tests/boussinesq_convection/src'
Makefile.src:2767: warning: overriding commands for target `nompicomm.o'
Makefile.src:2569: warning: ignoring old commands for target `nompicomm.o'
scripts/mkcparam -b noborder_profiles.f90 nochemistry.f90 nochiral.f90 nocosmicray.f90 nocosmicrayflux.f90 experimental/boussinesq.f90 deriv.f90 nodetonate.f90 nodustdensity.f90 nodustvelocity.f90 temperature_idealgas.f90 eos_idealgas.f90 nofixed_point.f90 noforcing.f90 nogravity.f90 nogpu.f90 grid.f90 noheatflux.f90 hydro.f90 nohyperresi_strict.f90 nohypervisc_strict.f90 noimplicit_diffusion.f90 noimplicit_physics.f90 noinitial_condition.f90 nointerstellar.f90 nolorenz_gauge.f90 nomagnetic.f90 magnetic/nomeanfield.f90 magnetic/nomeanfield_demfdt.f90 noneutraldensity.f90 noneutralvelocity.f90 noNSCBC.f90 noopacity.f90 noparticles.f90 noparticles_adaptation.f90 noparticles_coagulation.f90 noparticles_condensation.f90  noparticles_collisions.f90 noparticles_map.f90 noparticles_density.f90  noparticles_mass.f90 noparticles_number.f90 noparticles_radius.f90 noparticles_potential.f90 noparticles_grad.f90 noparticles_selfgravity.f90 noparticles_sink.f90 noparticles_drag.f90 noparticles_spin.f90 noparticles_stalker.f90 noparticles_lyapunov.f90 noparticles_caustics.f90 noparticles_tetrad.f90 noparticles_stirring.f90 noparticles_diagnos_dv.f90 noparticles_diagnos_state.f90 noparticles_persistence.f90 noparticles_temperature.f90 noparticles_adsorbed.f90 noparticles_surfspec.f90 noparticles_chemistry.f90 nopointmasses.f90 poisson.f90 nopolymer.f90 nopower_spectrum.f90 nopscalar.f90 noradiation.f90 noselfgravity.f90 noshear.f90 noshock.f90 nosignal_handling.f90 nosolid_cells.f90 nospecial.f90 noascalar.f90 nostreamlines.f90  notestfield.f90 notestflow.f90 notestscalar.f90 viscosity.f90 cparam.local -o cparam.inc.tmp
${PENCIL_HOME}/utils/pc_identify_revision --reset
make -f Makefile.src  start.o run.o start.x run.x
make[2]: Entering directory `/home/pencil/daily-test/samples/2d-tests/boussinesq_convection/src'
Makefile.src:2767: warning: overriding commands for target `nompicomm.o'
Makefile.src:2569: warning: ignoring old commands for target `nompicomm.o'
mpif90 -O -O0 -Wall -finit-real=NaN -finit-integer=-2147483648 -g -fbacktrace -fimplicit-none -fcheck=all -ffpe-trap=invalid,zero,overflow    -std=f95 -o cparam.o -c cparam.f90
mpicc -DFUNDERSC=1    -o syscalls_ansi.o -c syscalls_ansi.c
scripts/mkdummyinc -d file_io_common.f90 -s file_io_f95.f90 -o file_io_common.inc
mpif90 -O -O0 -Wall -finit-real=NaN -finit-integer=-2147483648 -g -fbacktrace -fimplicit-none -fcheck=all -ffpe-trap=invalid,zero,overflow     -o fftpack.o -c fftpack.f90
mpicc -DFUNDERSC=1    -o nogsl.o -c nogsl.c
../src/cparam_pencils.inc:397:
    Included at cparam.f90:30:

   , 'acc             ', 'gacc            ', 'ugacc           ', 'del2acc      
1
Warning: Limit of 39 continuations exceeded in statement at (1)
mpif90 -O -O0 -Wall -finit-real=NaN -finit-integer=-2147483648 -g -fbacktrace -fimplicit-none -fcheck=all -ffpe-trap=invalid,zero,overflow    -std=f95 -o cdata.o -c cdata.f90
mpif90 -O -O0 -Wall -finit-real=NaN -finit-integer=-2147483648 -g -fbacktrace -fimplicit-none -fcheck=all -ffpe-trap=invalid,zero,overflow    -std=f95 -o syscalls.o -c syscalls.f90
fftpack.f90:154.33:

        call passb4 ( 2*ido, l1, c, ch, wa(iw), wa(ix2), wa(ix3) )
                                 1
Warning: Type mismatch in argument 'cc' at (1); passed COMPLEX(4) to REAL(4)
fftpack.f90:156.33:

        call passb4 ( 2*ido, l1, ch, c, wa(iw), wa(ix2), wa(ix3) )
                                 1
Warning: Type mismatch in argument 'cc' at (1); passed COMPLEX(4) to REAL(4)
fftpack.f90:164.33:

        call passb2 ( 2*ido, l1, c, ch, wa(iw) )
                                 1
Warning: Type mismatch in argument 'cc' at (1); passed COMPLEX(4) to REAL(4)
fftpack.f90:166.33:

        call passb2 ( 2*ido, l1, ch, c, wa(iw) )
                                 1
Warning: Type mismatch in argument 'cc' at (1); passed COMPLEX(4) to REAL(4)
fftpack.f90:176.33:

        call passb3 ( 2*ido, l1, c, ch, wa(iw), wa(ix2) )
                                 1
Warning: Type mismatch in argument 'cc' at (1); passed COMPLEX(4) to REAL(4)
fftpack.f90:178.33:

        call passb3 ( 2*ido, l1, ch, c, wa(iw), wa(ix2) )
                                 1
Warning: Type mismatch in argument 'cc' at (1); passed COMPLEX(4) to REAL(4)
fftpack.f90:190.33:

        call passb5 ( 2*ido, l1, c, ch, wa(iw), wa(ix2), wa(ix3), wa(ix4) )
                                 1
Warning: Type mismatch in argument 'cc' at (1); passed COMPLEX(4) to REAL(4)
fftpack.f90:192.33:

        call passb5 ( 2*ido, l1, ch, c, wa(iw), wa(ix2), wa(ix3), wa(ix4) )
                                 1
Warning: Type mismatch in argument 'cc' at (1); passed COMPLEX(4) to REAL(4)
fftpack.f90:200.47:

        call passb ( nac, 2*ido, ip, l1, idl1, c, c, c, ch, ch, wa(iw) )
                                               1
Warning: Type mismatch in argument 'cc' at (1); passed COMPLEX(4) to REAL(4)
fftpack.f90:202.47:

        call passb ( nac, 2*ido, ip, l1, idl1, ch, ch, ch, c, c, wa(iw) )
                                               1
Warning: Type mismatch in argument 'cc' at (1); passed COMPLEX(4) to REAL(4)
fftpack.f90:76.22:

  call cfftb1 ( n, c, wsave(1), wsave(2*n+1), wsave(4*n+1) )
                      1
Warning: Type mismatch in argument 'ch' at (1); passed REAL(4) to COMPLEX(4)
fftpack.f90:447.33:

        call passf4 ( 2*ido, l1, c, ch, wa(iw), wa(ix2), wa(ix3) )
                                 1
Warning: Type mismatch in argument 'cc' at (1); passed COMPLEX(4) to REAL(4)
fftpack.f90:449.33:

        call passf4 ( 2*ido, l1, ch, c, wa(iw), wa(ix2), wa(ix3) )
                                 1
Warning: Type mismatch in argument 'cc' at (1); passed COMPLEX(4) to REAL(4)
fftpack.f90:457.33:

        call passf2 ( 2*ido, l1, c, ch, wa(iw) )
                                 1
Warning: Type mismatch in argument 'cc' at (1); passed COMPLEX(4) to REAL(4)
fftpack.f90:459.33:

        call passf2 ( 2*ido, l1, ch, c, wa(iw) )
                                 1
Warning: Type mismatch in argument 'cc' at (1); passed COMPLEX(4) to REAL(4)
fftpack.f90:469.33:

        call passf3 ( 2*ido, l1, c, ch, wa(iw), wa(ix2) )
                                 1
Warning: Type mismatch in argument 'cc' at (1); passed COMPLEX(4) to REAL(4)
fftpack.f90:471.33:

        call passf3 ( 2*ido, l1, ch, c, wa(iw), wa(ix2) )
                                 1
Warning: Type mismatch in argument 'cc' at (1); passed COMPLEX(4) to REAL(4)
fftpack.f90:483.33:

        call passf5 ( 2*ido, l1, c, ch, wa(iw), wa(ix2), wa(ix3), wa(ix4) )
                                 1
Warning: Type mismatch in argument 'cc' at (1); passed COMPLEX(4) to REAL(4)
fftpack.f90:485.33:

        call passf5 ( 2*ido, l1, ch, c, wa(iw), wa(ix2), wa(ix3), wa(ix4) )
                                 1
Warning: Type mismatch in argument 'cc' at (1); passed COMPLEX(4) to REAL(4)
fftpack.f90:493.47:

        call passf ( nac, 2*ido, ip, l1, idl1, c, c, c, ch, ch, wa(iw) )
                                               1
Warning: Type mismatch in argument 'cc' at (1); passed COMPLEX(4) to REAL(4)
fftpack.f90:495.47:

        call passf ( nac, 2*ido, ip, l1, idl1, ch, ch, ch, c, c, wa(iw) )
                                               1
Warning: Type mismatch in argument 'cc' at (1); passed COMPLEX(4) to REAL(4)
fftpack.f90:370.22:

  call cfftf1 ( n, c, wsave(1), wsave(2*n+1), wsave(4*n+1) )
                      1
Warning: Type mismatch in argument 'ch' at (1); passed REAL(4) to COMPLEX(4)
fftpack.f90:645.33:

  call cffti1 ( n, wsave(2*n+1), wsave(4*n+1) )
                                 1
Warning: Type mismatch in argument 'ifac' at (1); passed REAL(4) to INTEGER(4)
fftpack.f90:6575.44:

  call rfftb1 ( n, r, wsave(1), wsave(n+1), wsave(2*n+1) )
                                            1
Warning: Type mismatch in argument 'ifac' at (1); passed REAL(4) to INTEGER(4)
fftpack.f90:6802.44:

  call rfftf1 ( n, r, wsave(1), wsave(n+1), wsave(2*n+1) )
                                            1
Warning: Type mismatch in argument 'ifac' at (1); passed REAL(4) to INTEGER(4)
fftpack.f90:6999.31:

  call rffti1 ( n, wsave(n+1), wsave(2*n+1) )
                               1
Warning: Type mismatch in argument 'ifac' at (1); passed REAL(4) to INTEGER(4)
fftpack.f90:2248.44:

  call dfftf1 ( n, r, wsave(1), wsave(n+1), wsave(2*n+1) )
                                            1
Warning: Type mismatch in argument 'ifac' at (1); passed REAL(8) to INTEGER(4)
fftpack.f90:2445.31:

  call dffti1 ( n, wsave(n+1), wsave(2*n+1) )
                               1
Warning: Type mismatch in argument 'ifac' at (1); passed REAL(8) to INTEGER(4)
fftpack.f90:2680.56:

  call dsint1 ( n, x, wsave(1), wsave(iw1), wsave(iw2), wsave(iw3) )
                                                        1
Warning: Type mismatch in argument 'ifac' at (1); passed REAL(8) to INTEGER(4)
fftpack.f90:3357.34:

  call ezffti1 ( n, wsave(2*n+1), wsave(3*n+1) )
                                  1
Warning: Type mismatch in argument 'ifac' at (1); passed REAL(4) to INTEGER(4)
fftpack.f90:8147.56:

  call rsint1 ( n, x, wsave(1), wsave(iw1), wsave(iw2), wsave(iw3) )
                                                        1
Warning: Type mismatch in argument 'ifac' at (1); passed REAL(4) to INTEGER(4)
mpif90 -O -O0 -Wall -finit-real=NaN -finit-integer=-2147483648 -g -fbacktrace -fimplicit-none -fcheck=all -ffpe-trap=invalid,zero,overflow    -std=f95 -o general.o -c general.f90
general.f90:2349.41:

      DATA Q1,Q2,Q3,Q4,Q5 /.04687499995D0,-.2002690873D-3,   &
                                         1
Warning: Change of value in conversion from  REAL(8) to REAL(4) at (1)
general.f90:2349.57:

      DATA Q1,Q2,Q3,Q4,Q5 /.04687499995D0,-.2002690873D-3,   &
                                                         1
Warning: Change of value in conversion from  REAL(8) to REAL(4) at (1)
general.f90:2350.20:

      .8449199096D-5,-.88228987D-6,.105787412D-6 /
                    1
Warning: Change of value in conversion from  REAL(8) to REAL(4) at (1)
general.f90:2350.34:

      .8449199096D-5,-.88228987D-6,.105787412D-6 /
                                  1
Warning: Change of value in conversion from  REAL(8) to REAL(4) at (1)
general.f90:2350.48:

      .8449199096D-5,-.88228987D-6,.105787412D-6 /
                                                1
Warning: Change of value in conversion from  REAL(8) to REAL(4) at (1)
general.f90:2348.54:

      .2457520174D-5,-.240337019D-6 /,P6 /.636619772D0 /
                                                      1
Warning: Change of value in conversion from  REAL(8) to REAL(4) at (1)
general.f90:2347.42:

      DATA P1,P2,P3,P4,P5 /1.D0,.183105D-2,-.3516396496D-4,  &
                                          1
Warning: Change of value in conversion from  REAL(8) to REAL(4) at (1)
general.f90:2347.58:

      DATA P1,P2,P3,P4,P5 /1.D0,.183105D-2,-.3516396496D-4,  &
                                                          1
Warning: Change of value in conversion from  REAL(8) to REAL(4) at (1)
general.f90:2348.20:

      .2457520174D-5,-.240337019D-6 /,P6 /.636619772D0 /
                    1
Warning: Change of value in conversion from  REAL(8) to REAL(4) at (1)
general.f90:2348.35:

      .2457520174D-5,-.240337019D-6 /,P6 /.636619772D0 /
                                   1
Warning: Change of value in conversion from  REAL(8) to REAL(4) at (1)
general.f90:2310.42:

      DATA Q1,Q2,Q3,Q4,Q5 /-.1562499995D-1,.1430488765D-3, &
                                          1
Warning: Change of value in conversion from  REAL(8) to REAL(4) at (1)
general.f90:2310.57:

      DATA Q1,Q2,Q3,Q4,Q5 /-.1562499995D-1,.1430488765D-3, &
                                                         1
Warning: Change of value in conversion from  REAL(8) to REAL(4) at (1)
general.f90:2311.21:

      -.6911147651D-5,.7621095161D-6,-.9349451520D-7 /
                     1
Warning: Change of value in conversion from  REAL(8) to REAL(4) at (1)
general.f90:2311.36:

      -.6911147651D-5,.7621095161D-6,-.9349451520D-7 /
                                    1
Warning: Change of value in conversion from  REAL(8) to REAL(4) at (1)
general.f90:2311.52:

      -.6911147651D-5,.7621095161D-6,-.9349451520D-7 /
                                                    1
Warning: Change of value in conversion from  REAL(8) to REAL(4) at (1)
general.f90:2308.47:

      DATA P1,P2,P3,P4,P5 /1.D0,-.1098628627D-2,.2734510407D-4, &
                                               1
Warning: Change of value in conversion from  REAL(8) to REAL(4) at (1)
general.f90:2308.62:

      DATA P1,P2,P3,P4,P5 /1.D0,-.1098628627D-2,.2734510407D-4, &
                                                              1
Warning: Change of value in conversion from  REAL(8) to REAL(4) at (1)
general.f90:2309.21:

      -.2073370639D-5,.2093887211D-6 /
                     1
Warning: Change of value in conversion from  REAL(8) to REAL(4) at (1)
general.f90:2309.36:

      -.2073370639D-5,.2093887211D-6 /
                                    1
Warning: Change of value in conversion from  REAL(8) to REAL(4) at (1)
general.f90:4527.33:

          thphprime(1,itp,jtp) = datan2(dble(sprime),dble(zprime))
                                 1
Warning: Possible change of value in conversion from REAL(8) to REAL(4) at (1)
general.f90:4528.33:

          thphprime(2,itp,jtp) = datan2(dble(yprime),dble(xprime))
                                 1
Warning: Possible change of value in conversion from REAL(8) to REAL(4) at (1)
general.f90:4613.10:

      use Cdata, only: iproc, iproc_world
          1
Warning: Unused module variable 'lroot' which has been explicitly imported at (1)
general.f90:4613.10:

      use Cdata, only: iproc, iproc_world
          1
Warning: Unused module variable 'lyang' which has been explicitly imported at (1)
general.f90:4550.10:

      use Cdata, only: costh,sinth,cosph,sinph, y, z
          1
Warning: Unused module variable 'cosph' which has been explicitly imported at (1)
general.f90:4550.10:

      use Cdata, only: costh,sinth,cosph,sinph, y, z
          1
Warning: Unused module variable 'costh' which has been explicitly imported at (1)
general.f90:4550.10:

      use Cdata, only: costh,sinth,cosph,sinph, y, z
          1
Warning: Unused module variable 'sinph' which has been explicitly imported at (1)
general.f90:4550.10:

      use Cdata, only: costh,sinth,cosph,sinph, y, z
          1
Warning: Unused module variable 'sinth' which has been explicitly imported at (1)
general.f90:4550.10:

      use Cdata, only: costh,sinth,cosph,sinph, y, z
          1
Warning: Unused module variable 'y' which has been explicitly imported at (1)
general.f90:4550.10:

      use Cdata, only: costh,sinth,cosph,sinph, y, z
          1
Warning: Unused module variable 'z' which has been explicitly imported at (1)
general.f90:4479.10:

      use Cdata, only: costh,sinth,cosph,sinph, y, z
          1
Warning: Unused module variable 'y' which has been explicitly imported at (1)
general.f90:4479.10:

      use Cdata, only: costh,sinth,cosph,sinph, y, z
          1
Warning: Unused module variable 'z' which has been explicitly imported at (1)
general.f90:197.10:

      use Cdata, only: mm,nn,imn_array,necessary,lroot,ip, &
          1
Warning: Unused module variable 'iproc' which has been explicitly imported at (1)
general.h:73.68:
    Included at general.f90:165:

   subroutine get_scattered_array(ivar,layer,src,dest,timediff,ahead)
                                                                    1
Warning: Unused dummy argument 'ahead' at (1)
general.h:73.53:
    Included at general.f90:165:

   subroutine get_scattered_array(ivar,layer,src,dest,timediff,ahead)
                                                     1
Warning: Unused dummy argument 'dest' at (1)
general.h:75.9:
    Included at general.f90:165:

     use Cdata, only:ldiagnos, iproc
         1
Warning: Unused module variable 'iproc' which has been explicitly imported at (1)
general.h:73.38:
    Included at general.f90:165:

   subroutine get_scattered_array(ivar,layer,src,dest,timediff,ahead)
                                      1
Warning: Unused dummy argument 'ivar' at (1)
general.h:73.44:
    Included at general.f90:165:

   subroutine get_scattered_array(ivar,layer,src,dest,timediff,ahead)
                                            1
Warning: Unused dummy argument 'layer' at (1)
general.h:75.9:
    Included at general.f90:165:

     use Cdata, only:ldiagnos, iproc
         1
Warning: Unused module variable 'ldiagnos' which has been explicitly imported at (1)
general.h:73.48:
    Included at general.f90:165:

   subroutine get_scattered_array(ivar,layer,src,dest,timediff,ahead)
                                                1
Warning: Unused dummy argument 'src' at (1)
general.h:73.62:
    Included at general.f90:165:

   subroutine get_scattered_array(ivar,layer,src,dest,timediff,ahead)
                                                              1
Warning: Unused dummy argument 'timediff' at (1)
general.h:59.55:
    Included at general.f90:165:

   subroutine store_scattered_array(ind3,layer,src,dest,time)
                                                       1
Warning: Unused dummy argument 'dest' at (1)
general.h:59.40:
    Included at general.f90:165:

   subroutine store_scattered_array(ind3,layer,src,dest,time)
                                        1
Warning: Unused dummy argument 'ind3' at (1)
general.h:61.9:
    Included at general.f90:165:

     use Cdata, only: iproc
         1
Warning: Unused module variable 'iproc' which has been explicitly imported at (1)
general.h:59.46:
    Included at general.f90:165:

   subroutine store_scattered_array(ind3,layer,src,dest,time)
                                              1
Warning: Unused dummy argument 'layer' at (1)
general.h:59.50:
    Included at general.f90:165:

   subroutine store_scattered_array(ind3,layer,src,dest,time)
                                                  1
Warning: Unused dummy argument 'src' at (1)
general.h:59.60:
    Included at general.f90:165:

   subroutine store_scattered_array(ind3,layer,src,dest,time)
                                                            1
Warning: Unused dummy argument 'time' at (1)
general.f90:5250:0: warning: ‘newton_arr’ defined but not used [-Wunused-function]
     subroutine newton_arr(x,func,add,fmax,dxmax,itmax)
 ^
general.f90:1461:0: warning: ‘tridag_double’ defined but not used [-Wunused-function]
     subroutine tridag_double(a,b,c,r,u,err)
 ^
mpif90 -O -O0 -Wall -finit-real=NaN -finit-integer=-2147483648 -g -fbacktrace -fimplicit-none -fcheck=all -ffpe-trap=invalid,zero,overflow    -std=f95 -o noyinyang.o -c noyinyang.f90
mpif90 -O -O0 -Wall -finit-real=NaN -finit-integer=-2147483648 -g -fbacktrace -fimplicit-none -fcheck=all -ffpe-trap=invalid,zero,overflow    -std=f95 -o slices_methods.o -c slices_methods.f90
mpif90 -O -O0 -Wall -finit-real=NaN -finit-integer=-2147483648 -g -fbacktrace -fimplicit-none -fcheck=all -ffpe-trap=invalid,zero,overflow    -std=f95 -o noweno_transport.o -c noweno_transport.f90
mpif90 -O -O0 -Wall -finit-real=NaN -finit-integer=-2147483648 -g -fbacktrace -fimplicit-none -fcheck=all -ffpe-trap=invalid,zero,overflow     -o nompicomm.o -c nompicomm.f90
nompicomm.f90:477.13:

             c1*cshift(f(l2i:l2,m1:m2,:,ivar1:ivar2),-displs+2,2) &
             1
Warning: Possible change of value in conversion from REAL(8) to REAL(4) at (1)
nompicomm.f90:484.13:

             c1*cshift(f(l1:l1i,m1:m2,:,ivar1:ivar2), displs-2,2) &
             1
Warning: Possible change of value in conversion from REAL(8) to REAL(4) at (1)
nompicomm.f90:2941.35:

      entry mpigather_and_out_cmplx( sendbuf_cmplx, unit, ltransp, kxrange, kyr
                                   1
Warning: Unused variable 'mpigather_and_out_cmplx' declared at (1)
nompicomm.f90:1584:0: warning: ‘mpireduce_sum_double_arr4’ defined but not used [-Wunused-function]
     subroutine mpireduce_sum_double_arr4(dsum_tmp,dsum,nreduce)
 ^
nompicomm.f90:1575:0: warning: ‘mpireduce_sum_double_arr3’ defined but not used [-Wunused-function]
     subroutine mpireduce_sum_double_arr3(dsum_tmp,dsum,nreduce)
 ^
nompicomm.f90:1566:0: warning: ‘mpireduce_sum_double_arr2’ defined but not used [-Wunused-function]
     subroutine mpireduce_sum_double_arr2(dsum_tmp,dsum,nreduce)
 ^
nompicomm.f90:1557:0: warning: ‘mpireduce_sum_double_arr’ defined but not used [-Wunused-function]
     subroutine mpireduce_sum_double_arr(dsum_tmp,dsum,nreduce)
 ^
nompicomm.f90:1549:0: warning: ‘mpireduce_sum_double_scl’ defined but not used [-Wunused-function]
     subroutine mpireduce_sum_double_scl(dsum_tmp,dsum)
 ^
mpif90 -O -O0 -Wall -finit-real=NaN -finit-integer=-2147483648 -g -fbacktrace -fimplicit-none -fcheck=all -ffpe-trap=invalid,zero,overflow    -std=f95 -o messages.o -c messages.f90
mpif90 -O -O0 -Wall -finit-real=NaN -finit-integer=-2147483648 -g -fbacktrace -fimplicit-none -fcheck=all -ffpe-trap=invalid,zero,overflow    -std=f95 -o ghost_check.o -c ghost_check.f90
mpif90 -O -O0 -Wall -finit-real=NaN -finit-integer=-2147483648 -g -fbacktrace -fimplicit-none -fcheck=all -ffpe-trap=invalid,zero,overflow    -std=f95 -o nogpu.o -c nogpu.f90
mpif90 -O -O0 -Wall -finit-real=NaN -finit-integer=-2147483648 -g -fbacktrace -fimplicit-none -fcheck=all -ffpe-trap=invalid,zero,overflow    -std=f95 -o nosolid_cells_mpicomm.o -c nosolid_cells_mpicomm.f90
mpif90 -O -O0 -Wall -finit-real=NaN -finit-integer=-2147483648 -g -fbacktrace -fimplicit-none -fcheck=all -ffpe-trap=invalid,zero,overflow    -std=f95 -o deriv.o -c deriv.f90
mpif90 -O -O0 -Wall -finit-real=NaN -finit-integer=-2147483648 -g -fbacktrace -fimplicit-none -fcheck=all -ffpe-trap=invalid,zero,overflow    -o file_io_f95.o -c file_io_f95.f90
mpif90 -O -O0 -Wall -finit-real=NaN -finit-integer=-2147483648 -g -fbacktrace -fimplicit-none -fcheck=all -ffpe-trap=invalid,zero,overflow    -std=f95 -o noyinyang_mpi.o -c noyinyang_mpi.f90
mpif90 -O -O0 -Wall -finit-real=NaN -finit-integer=-2147483648 -g -fbacktrace -fimplicit-none -fcheck=all -ffpe-trap=invalid,zero,overflow    -std=f95 -o shared_variables.o -c shared_variables.f90
mpif90 -O -O0 -Wall -finit-real=NaN -finit-integer=-2147483648 -g -fbacktrace -fimplicit-none -fcheck=all -ffpe-trap=invalid,zero,overflow    -std=f95 -o debug_io_dist.o -c debug_io_dist.f90
mpif90 -O -O0 -Wall -finit-real=NaN -finit-integer=-2147483648 -g -fbacktrace -fimplicit-none -fcheck=all -ffpe-trap=invalid,zero,overflow    -std=f95 -o noimplicit_diffusion.o -c noimplicit_diffusion.f90
shared_variables.f90:266:0: warning: ‘get_variable_real0d_alt’ defined but not used [-Wunused-function]
     subroutine get_variable_real0d_alt(varname,variable,ierr)
 ^
debug_io_dist.f90:237.13:

      t_sp = t
             1
Warning: Possible change of value in conversion from REAL(8) to REAL(4) at (1)
debug_io_dist.f90:206.13:

      t_sp = t
             1
Warning: Possible change of value in conversion from REAL(8) to REAL(4) at (1)
debug_io_dist.f90:152.13:

      t_sp = t
             1
Warning: Possible change of value in conversion from REAL(8) to REAL(4) at (1)
debug_io_dist.f90:95.13:

      t_sp = t
             1
Warning: Possible change of value in conversion from REAL(8) to REAL(4) at (1)
debug_io_dist.f90:221.38:

    subroutine output_pencil_scal(file,a,ndim)
                                      1
Warning: Unused dummy argument 'file' at (1)
debug_io_dist.f90:192.38:

    subroutine output_pencil_vect(file,a,ndim)
                                      1
Warning: Unused dummy argument 'file' at (1)
deriv.f90:2068:

             ( 3572100.0 * f( l1:l2 , m + 2 , n + 1 , k ))+&
1
Warning: Limit of 39 continuations exceeded in statement at (1)
deriv.f90:2627:

               ( 1170.0 * f( l1+1:l2+1 , m + 3 , n - 1 , ik ))+&
1
Warning: Limit of 39 continuations exceeded in statement at (1)
deriv.f90:2888:

               ( 1170.0 * f( l1+1:l2+1 , m - 1 , n + 3 , ik ))+&
1
Warning: Limit of 39 continuations exceeded in statement at (1)
deriv.f90:3149:

               ( 1170.0 * f( l1+3:l2+3 , m + 1 , n - 1 , ik ))+&
1
Warning: Limit of 39 continuations exceeded in statement at (1)
deriv.f90:3410:

               ( 1170.0 * f( l1-1:l2-1 , m + 1 , n + 3 , ik ))+&
1
Warning: Limit of 39 continuations exceeded in statement at (1)
deriv.f90:3671:

               ( 1170.0 * f( l1+3:l2+3 , m - 1 , n + 1 , ik ))+&
1
Warning: Limit of 39 continuations exceeded in statement at (1)
deriv.f90:3932:

               ( 1170.0 * f( l1-1:l2-1 , m + 3 , n + 1 , ik ))+&
1
Warning: Limit of 39 continuations exceeded in statement at (1)
deriv.f90:4231:

               ( 1755.0 * f( l1+1:l2+1 , m + 3 , n - 1 , ik ))+&
1
Warning: Limit of 39 continuations exceeded in statement at (1)
deriv.f90:4492:

               ( 1755.0 * f( l1+3:l2+3 , m + 1 , n - 1 , ik ))+&
1
Warning: Limit of 39 continuations exceeded in statement at (1)
deriv.f90:4753:

               ( 1755.0 * f( l1+3:l2+3 , m - 1 , n + 1 , ik ))+&
1
Warning: Limit of 39 continuations exceeded in statement at (1)
file_io_common.inc:352.38:
    Included at file_io_f95.f90:346:

      if (name /= '') type = '_'//type
                                      1
Warning: CHARACTER expression will be truncated in assignment (5/6) at (1)
file_io_common.inc:39.12:
    Included at file_io_f95.f90:346:

      len = rec_len
            1
Warning: Possible change of value in conversion from INTEGER(8) to INTEGER(4) at (1)
file_io_common.inc:40.12:
    Included at file_io_f95.f90:346:

      num = num_rec
            1
Warning: Possible change of value in conversion from INTEGER(8) to INTEGER(4) at (1)
file_io_common.inc:245.48:
    Included at file_io_f95.f90:346:

    function list_files(name,options,only_number) result (num)
                                                1
Warning: Unused dummy argument 'only_number' at (1)
file_io_f95.f90:184:0: warning: ‘write_binary_file_str’ defined but not used [-Wunused-function]
     subroutine write_binary_file_str(file,bytes,buffer)
 ^
mpif90 -O -O0 -Wall -finit-real=NaN -finit-integer=-2147483648 -g -fbacktrace -fimplicit-none -fcheck=all -ffpe-trap=invalid,zero,overflow    -std=f95 -o nohdf5_io.o -c nohdf5_io.f90
nohdf5_io.f90:883.54:

    subroutine output_average_2D(path, label, nc, name, data, time, lbinary, lw
                                                      1
Warning: Unused dummy argument 'name' at (1)
nohdf5_io.f90:860.74:

    subroutine output_average_1D_chunked(path, label, nc, name, data, full, tim
                                                                          1
Warning: Unused dummy argument 'full' at (1)
nohdf5_io.f90:824.54:

    subroutine output_average_1D(path, label, nc, name, data, time, lbinary, lw
                                                      1
Warning: Unused dummy argument 'name' at (1)
nohdf5_io.f90:797.59:

    subroutine input_profile(fname, type, a, np, lhas_ghost)
                                                           1
Warning: Unused dummy argument 'lhas_ghost' at (1)
nohdf5_io.f90:760.75:

    subroutine output_profile(fname, coord, a, type, lsave_name, lhas_ghost)
                                                                           1
Warning: Unused dummy argument 'lhas_ghost' at (1)
nohdf5_io.f90:642.70:

    subroutine output_slice(lwrite, time, label, suffix, pos, grid_pos, data)
                                                                      1
Warning: Unused dummy argument 'grid_pos' at (1)
nohdf5_io.f90:524.37:

    subroutine output_timeseries(data, data_im)
                                     1
Warning: Unused dummy argument 'data' at (1)
nohdf5_io.f90:524.46:

    subroutine output_timeseries(data, data_im)
                                              1
Warning: Unused dummy argument 'data_im' at (1)
nohdf5_io.f90:434.47:

    subroutine output_hdf5_double_1D(name, data, nv)
                                               1
Warning: Unused dummy argument 'data' at (1)
nohdf5_io.f90:424.47:

    subroutine output_hdf5_double_0D(name, data)
                                               1
Warning: Unused dummy argument 'data' at (1)
nohdf5_io.f90:180.47:

    subroutine input_hdf5_profile_1D(name, data, ldim, gdim, np1, np2)
                                               1
Warning: Unused dummy argument 'data' at (1)
nohdf5_io.f90:536:0: warning: ‘input_slice_position’ defined but not used [-Wunused-function]
     subroutine input_slice_position(directory,ix_bc_,iy_bc_,iy2_bc_,iz_bc_,iz2_bc_,iz3_bc_,iz4_bc_)
 ^
mpif90 -O -O0 -Wall -finit-real=NaN -finit-integer=-2147483648 -g -fbacktrace -fimplicit-none -fcheck=all -ffpe-trap=invalid,zero,overflow    -std=f95 -o farray.o -c farray.f90
mpif90 -O -O0 -Wall -finit-real=NaN -finit-integer=-2147483648 -g -fbacktrace -fimplicit-none -fcheck=all -ffpe-trap=invalid,zero,overflow    -std=f95 -o io_dist.o -c io_dist.f90
farray.f90:427.21:

      do i=1,mscratch
                     1
Warning: DO loop at (1) will be executed zero times
io_dist.f90:1481.23:

          procx_bounds=procx_boundsdb; procy_bounds=procy_boundsdb; procz_bound
                       1
Warning: Possible change of value in conversion from REAL(8) to REAL(4) at (1)
io_dist.f90:1481.52:

          procx_bounds=procx_boundsdb; procy_bounds=procy_boundsdb; procz_bound
                                                    1
Warning: Possible change of value in conversion from REAL(8) to REAL(4) at (1)
io_dist.f90:1481.81:

    procx_bounds=procx_boundsdb; procy_bounds=procy_boundsdb; procz_bounds=proc
                                                                           1
Warning: Possible change of value in conversion from REAL(8) to REAL(4) at (1)
io_dist.f90:1409.14:

            x=xdb; y=ydb; z=zdb; dx=dxdb; dy=dydb; dz=dzdb
              1
Warning: Possible change of value in conversion from REAL(8) to REAL(4) at (1)
io_dist.f90:1409.21:

            x=xdb; y=ydb; z=zdb; dx=dxdb; dy=dydb; dz=dzdb
                     1
Warning: Possible change of value in conversion from REAL(8) to REAL(4) at (1)
io_dist.f90:1409.28:

            x=xdb; y=ydb; z=zdb; dx=dxdb; dy=dydb; dz=dzdb
                            1
Warning: Possible change of value in conversion from REAL(8) to REAL(4) at (1)
io_dist.f90:1409.36:

            x=xdb; y=ydb; z=zdb; dx=dxdb; dy=dydb; dz=dzdb
                                    1
Warning: Possible change of value in conversion from REAL(8) to REAL(4) at (1)
io_dist.f90:1409.45:

            x=xdb; y=ydb; z=zdb; dx=dxdb; dy=dydb; dz=dzdb
                                             1
Warning: Possible change of value in conversion from REAL(8) to REAL(4) at (1)
io_dist.f90:1409.54:

            x=xdb; y=ydb; z=zdb; dx=dxdb; dy=dydb; dz=dzdb
                                                      1
Warning: Possible change of value in conversion from REAL(8) to REAL(4) at (1)
io_dist.f90:1410.15:

            Lx=Lxdb; Ly=Lydb; Lz=Lzdb; dx_1=dx_1db; dy_1=dy_1db; dz_1=dz_1db
               1
Warning: Possible change of value in conversion from REAL(8) to REAL(4) at (1)
io_dist.f90:1410.24:

            Lx=Lxdb; Ly=Lydb; Lz=Lzdb; dx_1=dx_1db; dy_1=dy_1db; dz_1=dz_1db
                        1
Warning: Possible change of value in conversion from REAL(8) to REAL(4) at (1)
io_dist.f90:1410.33:

            Lx=Lxdb; Ly=Lydb; Lz=Lzdb; dx_1=dx_1db; dy_1=dy_1db; dz_1=dz_1db
                                 1
Warning: Possible change of value in conversion from REAL(8) to REAL(4) at (1)
io_dist.f90:1410.44:

            Lx=Lxdb; Ly=Lydb; Lz=Lzdb; dx_1=dx_1db; dy_1=dy_1db; dz_1=dz_1db
                                            1
Warning: Possible change of value in conversion from REAL(8) to REAL(4) at (1)
io_dist.f90:1410.57:

            Lx=Lxdb; Ly=Lydb; Lz=Lzdb; dx_1=dx_1db; dy_1=dy_1db; dz_1=dz_1db
                                                         1
Warning: Possible change of value in conversion from REAL(8) to REAL(4) at (1)
io_dist.f90:1410.70:

            Lx=Lxdb; Ly=Lydb; Lz=Lzdb; dx_1=dx_1db; dy_1=dy_1db; dz_1=dz_1db
                                                                      1
Warning: Possible change of value in conversion from REAL(8) to REAL(4) at (1)
io_dist.f90:1411.21:

            dx_tilde=dx_tildedb; dy_tilde=dy_tildedb; dz_tilde=dz_tildedb
                     1
Warning: Possible change of value in conversion from REAL(8) to REAL(4) at (1)
io_dist.f90:1411.42:

            dx_tilde=dx_tildedb; dy_tilde=dy_tildedb; dz_tilde=dz_tildedb
                                          1
Warning: Possible change of value in conversion from REAL(8) to REAL(4) at (1)
io_dist.f90:1411.63:

            dx_tilde=dx_tildedb; dy_tilde=dy_tildedb; dz_tilde=dz_tildedb
                                                               1
Warning: Possible change of value in conversion from REAL(8) to REAL(4) at (1)
io_dist.f90:1144.12:

          a=adb
            1
Warning: Possible change of value in conversion from REAL(8) to REAL(4) at (1)
io_dist.f90:1071.16:

          value=vdb
                1
Warning: Possible change of value in conversion from REAL(8) to REAL(4) at (1)
io_dist.f90:1041.16:

          value=vdb
                1
Warning: Possible change of value in conversion from REAL(8) to REAL(4) at (1)
io_dist.f90:785.17:

        t_test = t_sp
                 1
Warning: Possible change of value in conversion from REAL(8) to REAL(4) at (1)
io_dist.f90:806.21:

            tstart = t_dbl
                     1
Warning: Possible change of value in conversion from REAL(8) to REAL(4) at (1)
io_dist.f90:814.19:

          tstart = t_sp
                   1
Warning: Possible change of value in conversion from REAL(8) to REAL(4) at (1)
io_dist.f90:519.12:

          a=adb; x=xdb; y=ydb; z=zdb; dx=dxdb; dy=dydb; dz=dzdb; deltay=deltaydb
            1
Warning: Possible change of value in conversion from REAL(8) to REAL(4) at (1)
io_dist.f90:519.19:

          a=adb; x=xdb; y=ydb; z=zdb; dx=dxdb; dy=dydb; dz=dzdb; deltay=deltaydb
                   1
Warning: Possible change of value in conversion from REAL(8) to REAL(4) at (1)
io_dist.f90:519.26:

          a=adb; x=xdb; y=ydb; z=zdb; dx=dxdb; dy=dydb; dz=dzdb; deltay=deltaydb
                          1
Warning: Possible change of value in conversion from REAL(8) to REAL(4) at (1)
io_dist.f90:519.33:

          a=adb; x=xdb; y=ydb; z=zdb; dx=dxdb; dy=dydb; dz=dzdb; deltay=deltaydb
                                 1
Warning: Possible change of value in conversion from REAL(8) to REAL(4) at (1)
io_dist.f90:519.41:

          a=adb; x=xdb; y=ydb; z=zdb; dx=dxdb; dy=dydb; dz=dzdb; deltay=deltaydb
                                         1
Warning: Possible change of value in conversion from REAL(8) to REAL(4) at (1)
io_dist.f90:519.50:

          a=adb; x=xdb; y=ydb; z=zdb; dx=dxdb; dy=dydb; dz=dzdb; deltay=deltaydb
                                                  1
Warning: Possible change of value in conversion from REAL(8) to REAL(4) at (1)
io_dist.f90:519.59:

          a=adb; x=xdb; y=ydb; z=zdb; dx=dxdb; dy=dydb; dz=dzdb; deltay=deltaydb
                                                           1
Warning: Possible change of value in conversion from REAL(8) to REAL(4) at (1)
io_dist.f90:519.72:

          a=adb; x=xdb; y=ydb; z=zdb; dx=dxdb; dy=dydb; dz=dzdb; deltay=deltaydb
                                                                        1
Warning: Possible change of value in conversion from REAL(8) to REAL(4) at (1)
io_dist.f90:252.13:

      t_sp = t
             1
Warning: Possible change of value in conversion from REAL(8) to REAL(4) at (1)
io_dist.f90:1085.48:

    subroutine output_globals(file, a, nv, label)
                                                1
Warning: Unused dummy argument 'label' at (1)
io_dist.f90:1054.47:

    logical function read_persist_real_1D(label, value)
                                               1
Warning: Unused dummy argument 'label' at (1)
io_dist.f90:1025.47:

    logical function read_persist_real_0D(label, value)
                                               1
Warning: Unused dummy argument 'label' at (1)
io_dist.f90:1011.46:

    logical function read_persist_int_1D(label, value)
                                              1
Warning: Unused dummy argument 'label' at (1)
io_dist.f90:997.46:

    logical function read_persist_int_0D(label, value)
                                              1
Warning: Unused dummy argument 'label' at (1)
io_dist.f90:983.50:

    logical function read_persist_logical_1D(label, value)
                                                  1
Warning: Unused dummy argument 'label' at (1)
io_dist.f90:969.50:

    logical function read_persist_logical_0D(label, value)
                                                  1
Warning: Unused dummy argument 'label' at (1)
io_dist.f90:878.43:

    subroutine input_pointmass(file, labels, fq, mv, nc)
                                           1
Warning: Unused dummy argument 'labels' at (1)
io_dist.f90:847.72:

    subroutine input_part_snap(ipar, ap, mv, nv, npar_total, file, label)
                                                                        1
Warning: Unused dummy argument 'label' at (1)
io_dist.f90:366.43:

    logical function write_persist_id(label, id)
                                           1
Warning: Unused dummy argument 'label' at (1)
io_dist.f90:311.44:

    subroutine output_pointmass(file, labels, fq, mv, nc)
                                            1
Warning: Unused dummy argument 'labels' at (1)
io_dist.f90:272.38:

      character (len=fnlen) :: dataset
                                      1
Warning: Unused variable 'dataset' declared at (1)
io_dist.f90:258.35:

    subroutine output_stalker(label, mv, nv, data, nvar, lfinalize)
                                   1
Warning: Unused dummy argument 'label' at (1)
io_dist.f90:236.48:

    subroutine output_stalker_init(num, nv, snap, ID)
                                                1
Warning: Unused dummy argument 'snap' at (1)
io_dist.f90:202.61:

    subroutine output_part_snap(ipar, ap, mv, nv, file, label, ltruncate)
                                                             1
Warning: Unused dummy argument 'label' at (1)
io_dist.f90:202.72:

    subroutine output_part_snap(ipar, ap, mv, nv, file, label, ltruncate)
                                                                        1
Warning: Unused dummy argument 'ltruncate' at (1)
mpif90 -O -O0 -Wall -finit-real=NaN -finit-integer=-2147483648 -g -fbacktrace -fimplicit-none -fcheck=all -ffpe-trap=invalid,zero,overflow    -std=f95 -o sub.o -c sub.f90
sub.f90:5311.13:

      coeff1=(/0.66761295020790986D00, &
             1
Warning: Possible change of value in conversion from REAL(8) to REAL(4) at (1)
sub.f90:5319.13:

      coeff2=(/0.66761295020791116D00, &
             1
Warning: Possible change of value in conversion from REAL(8) to REAL(4) at (1)
sub.f90:3807.13:

      t_sp = t
             1
Warning: Possible change of value in conversion from REAL(8) to REAL(4) at (1)
sub.f90:3769.12:

        dt_=tsnap-t
            1
Warning: Possible change of value in conversion from REAL(8) to REAL(4) at (1)
sub.f90:3681.13:

        t_sp=log10(t)
             1
Warning: Possible change of value in conversion from REAL(8) to REAL(4) at (1)
sub.f90:3683.13:

        t_sp=t
             1
Warning: Possible change of value in conversion from REAL(8) to REAL(4) at (1)
sub.f90:3619.19:

            tout = log10(t)
                   1
Warning: Possible change of value in conversion from REAL(8) to REAL(4) at (1)
sub.f90:3623.19:

            tout = t0 + (dble(dtout) - modulo(t0, dble(dtout)))
                   1
Warning: Possible change of value in conversion from REAL(8) to REAL(4) at (1)
sub.f90:3641.13:

      nout = bcast_array(2)
             1
Warning: Possible change of value in conversion from REAL(4) to INTEGER(4) at (1)
sub.f90:377.14:

          res=sum(dble(a))     ! sum at double precision to improve accuracy
              1
Warning: Possible change of value in conversion from REAL(8) to REAL(4) at (1)
sub.f90:385.14:

          res=res+sum(dble(a))
              1
Warning: Possible change of value in conversion from REAL(8) to REAL(4) at (1)
sub.f90:4243.21:

      entry ylm_other(theta,phi,ell,emm,der) result (sph_har)
                     1
Warning: Unused variable 'ylm_other' declared at (1)
sub.f90:4661:0: warning: ‘nan_inform’ defined but not used [-Wunused-function]
     subroutine nan_inform(f,msg,region,int1,int2,int3,int4,lstop)
 ^
sub.f90:1598:0: warning: ‘der_2nd_stag’ defined but not used [-Wunused-function]
     subroutine der_2nd_stag(f,k,df,j)
 ^
sub.f90:1522:0: warning: ‘der_2nd’ defined but not used [-Wunused-function]
     subroutine der_2nd(f,k,df,j)
 ^
sub.f90:629:0: warning: ‘contract_jk3’ defined but not used [-Wunused-function]
     subroutine contract_jk3(a,c)
 ^
sub.f90:498:0: warning: ‘rms2_mn’ defined but not used [-Wunused-function]
     subroutine rms2_mn(a2,res)
 ^
sub.f90:463:0: warning: ‘rms_mn’ defined but not used [-Wunused-function]
     subroutine rms_mn(a,res)
 ^
sub.f90:358:0: warning: ‘mean_mn’ defined but not used [-Wunused-function]
     subroutine mean_mn(a,res)
 ^
mpif90 -O -O0 -Wall -finit-real=NaN -finit-integer=-2147483648 -g -fbacktrace -fimplicit-none -fcheck=all -ffpe-trap=invalid,zero,overflow    -std=f95 -o diagnostics.o -c diagnostics.f90
mpif90 -O -O0 -Wall -finit-real=NaN -finit-integer=-2147483648 -g -fbacktrace -fimplicit-none -fcheck=all -ffpe-trap=invalid,zero,overflow    -std=f95 -o fourier_fftpack.o -c fourier_fftpack.f90
mpif90 -O -O0 -Wall -finit-real=NaN -finit-integer=-2147483648 -g -fbacktrace -fimplicit-none -fcheck=all -ffpe-trap=invalid,zero,overflow    -std=f95 -o noborder_profiles.o -c noborder_profiles.f90
mpif90 -O -O0 -Wall -finit-real=NaN -finit-integer=-2147483648 -g -fbacktrace -fimplicit-none -fcheck=all -ffpe-trap=invalid,zero,overflow    -std=f95 -o noshock.o -c noshock.f90
mpif90 -O -O0 -Wall -finit-real=NaN -finit-integer=-2147483648 -g -fbacktrace -fimplicit-none -fcheck=all -ffpe-trap=invalid,zero,overflow    -std=f95 -o grid.o -c grid.f90
mpif90 -O -O0 -Wall -finit-real=NaN -finit-integer=-2147483648 -g -fbacktrace -fimplicit-none -fcheck=all -ffpe-trap=invalid,zero,overflow    -std=f95 -o nolorenz_gauge.o -c nolorenz_gauge.f90
mpif90 -O -O0 -Wall -finit-real=NaN -finit-integer=-2147483648 -g -fbacktrace -fimplicit-none -fcheck=all -ffpe-trap=invalid,zero,overflow    -std=f95 -o nodebug.o -c nodebug.f90
mpif90 -O -O0 -Wall -finit-real=NaN -finit-integer=-2147483648 -g -fbacktrace -fimplicit-none -fcheck=all -ffpe-trap=invalid,zero,overflow    -std=f95 -o nostreamlines.o -c nostreamlines.f90
mpif90 -O -O0 -Wall -finit-real=NaN -finit-integer=-2147483648 -g -fbacktrace -fimplicit-none -fcheck=all -ffpe-trap=invalid,zero,overflow    -std=f95 -o nosignal_handling.o -c nosignal_handling.f90
mpif90 -O -O0 -Wall -finit-real=NaN -finit-integer=-2147483648 -g -fbacktrace -fimplicit-none -fcheck=all -ffpe-trap=invalid,zero,overflow    -std=f95 -o nofixed_point.o -c nofixed_point.f90
grid.f90:2001.11:

           dxyz(1)*0.5*(xi-delta(1)*log(cosh(dble((xi-xistep(1))/delta(1))))) +
           1
Warning: Possible change of value in conversion from REAL(8) to REAL(4) at (1)
grid.f90:2008.14:

              dxyz(1)*0.5*(1.0-tanh(dble((xi-xistep(1))/delta(1))) ) +  &
              1
Warning: Possible change of value in conversion from REAL(8) to REAL(4) at (1)
grid.f90:2016.16:

                + 0.5/delta(1)*(dxyz(2)-dxyz(1))/cosh(dble((xi-xistep(1))/delta
                1
Warning: Possible change of value in conversion from REAL(8) to REAL(4) at (1)
grid.f90:2021.11:

           dxyz(2)*0.5*(xi-delta(2)*log(cosh(dble((xi-xistep(2))/delta(2)))) )+
           1
Warning: Possible change of value in conversion from REAL(8) to REAL(4) at (1)
grid.f90:2026.14:

              dxyz(2)*0.5*(1.0-tanh(dble((xi-xistep(2))/delta(2))) ) +  &
              1
Warning: Possible change of value in conversion from REAL(8) to REAL(4) at (1)
grid.f90:2032.16:

                + 0.5/delta(2)*(dxyz(3)-dxyz(2))/cosh(dble((xi-xistep(2))/delta
                1
Warning: Possible change of value in conversion from REAL(8) to REAL(4) at (1)
fourier_fftpack.f90:4074.32:

          do ipy_from=1,nprocy-1
                                1
Warning: DO loop at (1) will be executed zero times
fourier_fftpack.f90:4150.32:

            do ipy_to=1,nprocy-1
                                1
Warning: DO loop at (1) will be executed zero times
fourier_fftpack.f90:3923.34:

            do ipy_send=1,nprocy-1
                                  1
Warning: DO loop at (1) will be executed zero times
fourier_fftpack.f90:3946.34:

            do ipy_send=1,nprocy-1
                                  1
Warning: DO loop at (1) will be executed zero times
fourier_fftpack.f90:3967.34:

            do ipy_send=1,nprocy-1
                                  1
Warning: DO loop at (1) will be executed zero times
fourier_fftpack.f90:3990.34:

            do ipy_send=1,nprocy-1
                                  1
Warning: DO loop at (1) will be executed zero times
mpif90 -O -O0 -Wall -finit-real=NaN -finit-integer=-2147483648 -g -fbacktrace -fimplicit-none -fcheck=all -ffpe-trap=invalid,zero,overflow    -std=f95 -o nodensity_methods.o -c nodensity_methods.f90
mpif90 -O -O0 -Wall -finit-real=NaN -finit-integer=-2147483648 -g -fbacktrace -fimplicit-none -fcheck=all -ffpe-trap=invalid,zero,overflow    -std=f95 -o nogravity.o -c nogravity.f90
mpif90 -O -O0 -Wall -finit-real=NaN -finit-integer=-2147483648 -g -fbacktrace -fimplicit-none -fcheck=all -ffpe-trap=invalid,zero,overflow    -std=f95 -o noinitial_condition.o -c noinitial_condition.f90
mpif90 -O -O0 -Wall -finit-real=NaN -finit-integer=-2147483648 -g -fbacktrace -fimplicit-none -fcheck=all -ffpe-trap=invalid,zero,overflow    -std=f95 -o nospecial.o -c nospecial.f90
mpif90 -O -O0 -Wall -finit-real=NaN -finit-integer=-2147483648 -g -fbacktrace -fimplicit-none -fcheck=all -ffpe-trap=invalid,zero,overflow    -std=f95 -o noopacity.o -c noopacity.f90
mpif90 -O -O0 -Wall -finit-real=NaN -finit-integer=-2147483648 -g -fbacktrace -fimplicit-none -fcheck=all -ffpe-trap=invalid,zero,overflow    -std=f95 -o noparticles_main.o -c noparticles_main.f90
mpif90 -O -O0 -Wall -finit-real=NaN -finit-integer=-2147483648 -g -fbacktrace -fimplicit-none -fcheck=all -ffpe-trap=invalid,zero,overflow    -std=f95 -o nostruct_func.o -c nostruct_func.f90
mpif90 -O -O0 -Wall -finit-real=NaN -finit-integer=-2147483648 -g -fbacktrace -fimplicit-none -fcheck=all -ffpe-trap=invalid,zero,overflow    -std=f95 -o notimeavg.o -c notimeavg.f90
mpif90 -O -O0 -Wall -finit-real=NaN -finit-integer=-2147483648 -g -fbacktrace -fimplicit-none -fcheck=all -ffpe-trap=invalid,zero,overflow    -std=f95 -o nopointmasses.o -c nopointmasses.f90
ar r noparticles_main.a noparticles_main.o
ar: creating noparticles_main.a
mpif90 -O -O0 -Wall -finit-real=NaN -finit-integer=-2147483648 -g -fbacktrace -fimplicit-none -fcheck=all -ffpe-trap=invalid,zero,overflow    -std=f95 -o magnetic/nomeanfield_demfdt.o -c magnetic/nomeanfield_demfdt.f90
mpif90 -O -O0 -Wall -finit-real=NaN -finit-integer=-2147483648 -g -fbacktrace -fimplicit-none -fcheck=all -ffpe-trap=invalid,zero,overflow    -std=f95 -o magnetic/nomeanfield.o -c magnetic/nomeanfield.f90
mpif90 -O -O0 -Wall -finit-real=NaN -finit-integer=-2147483648 -g -fbacktrace -fimplicit-none -fcheck=all -ffpe-trap=invalid,zero,overflow    -std=f95 -o eos_idealgas.o -c eos_idealgas.f90
mpif90 -O -O0 -Wall -finit-real=NaN -finit-integer=-2147483648 -g -fbacktrace -fimplicit-none -fcheck=all -ffpe-trap=invalid,zero,overflow    -std=f95 -o noshear.o -c noshear.f90
mpif90 -O -O0 -Wall -finit-real=NaN -finit-integer=-2147483648 -g -fbacktrace -fimplicit-none -fcheck=all -ffpe-trap=invalid,zero,overflow    -std=f95 -o poisson.o -c poisson.f90
mpif90 -O -O0 -Wall -finit-real=NaN -finit-integer=-2147483648 -g -fbacktrace -fimplicit-none -fcheck=all -ffpe-trap=invalid,zero,overflow    -std=f95 -o nohyperresi_strict.o -c nohyperresi_strict.f90
mpif90 -O -O0 -Wall -finit-real=NaN -finit-integer=-2147483648 -g -fbacktrace -fimplicit-none -fcheck=all -ffpe-trap=invalid,zero,overflow    -std=f95 -o nohypervisc_strict.o -c nohypervisc_strict.f90
mpif90 -O -O0 -Wall -finit-real=NaN -finit-integer=-2147483648 -g -fbacktrace -fimplicit-none -fcheck=all -ffpe-trap=invalid,zero,overflow    -std=f95 -o noghostfold.o -c noghostfold.f90
mpif90 -O -O0 -Wall -finit-real=NaN -finit-integer=-2147483648 -g -fbacktrace -fimplicit-none -fcheck=all -ffpe-trap=invalid,zero,overflow    -std=f95 -o nopower_spectrum.o -c nopower_spectrum.f90
eos_idealgas.f90:161.22:

        Rgas_unit_sys=k_B_cgs/m_u_cgs
                      1
Warning: Change of value in conversion from  REAL(8) to REAL(4) at (1)
eos_idealgas.f90:163.22:

        Rgas_unit_sys=k_B_cgs/m_u_cgs*1.0e-4
                      1
Warning: Change of value in conversion from  REAL(8) to REAL(4) at (1)
eos_idealgas.f90:187.13:

        Rgas=Rgas_unit_sys*unit_temperature/unit_velocity**2
             1
Warning: Possible change of value in conversion from REAL(8) to REAL(4) at (1)
eos_idealgas.f90:472.32:

    subroutine rprint_eos(lreset,lwrite)
                                1
Warning: Unused dummy argument 'lreset' at (1)
eos_idealgas.f90:472.39:

    subroutine rprint_eos(lreset,lwrite)
                                       1
Warning: Unused dummy argument 'lwrite' at (1)
eos_idealgas.f90:2108:0: warning: ‘bdry_magnetic’ defined but not used [-Wunused-function]
     subroutine bdry_magnetic(f,quench,task)
 ^
eos_idealgas.f90:2074:0: warning: ‘hminus_opacity’ defined but not used [-Wunused-function]
     subroutine Hminus_opacity(f,kapparho)
 ^
eos_idealgas.f90:1321:0: warning: ‘thermal_energy_hessian’ defined but not used [-Wunused-function]
     subroutine thermal_energy_hessian(f,ivar_eth,del2lneth,hlneth)
 ^
mpif90 -O -O0 -Wall -finit-real=NaN -finit-integer=-2147483648 -g -fbacktrace -fimplicit-none -fcheck=all -ffpe-trap=invalid,zero,overflow    -std=f95 -o initcond.o -c initcond.f90
mpif90 -O -O0 -Wall -finit-real=NaN -finit-integer=-2147483648 -g -fbacktrace -fimplicit-none -fcheck=all -ffpe-trap=invalid,zero,overflow    -std=f95 -o boundcond.o -c boundcond.f90
mpif90 -O -O0 -Wall -finit-real=NaN -finit-integer=-2147483648 -g -fbacktrace -fimplicit-none -fcheck=all -ffpe-trap=invalid,zero,overflow    -std=f95 -o nointerstellar.o -c nointerstellar.f90
mpif90 -O -O0 -Wall -finit-real=NaN -finit-integer=-2147483648 -g -fbacktrace -fimplicit-none -fcheck=all -ffpe-trap=invalid,zero,overflow    -std=f95 -o noheatflux.o -c noheatflux.f90
mpif90 -O -O0 -Wall -finit-real=NaN -finit-integer=-2147483648 -g -fbacktrace -fimplicit-none -fcheck=all -ffpe-trap=invalid,zero,overflow    -std=f95 -o noselfgravity.o -c noselfgravity.f90
initcond.f90:6391.19:

      mass_cloud = (mass_cloud * M_sun) / unit_mass
                   1
Warning: Possible change of value in conversion from REAL(8) to REAL(4) at (1)
initcond.f90:6409.18:

           bigr = var1/unit_length
                  1
Warning: Possible change of value in conversion from REAL(8) to REAL(4) at (1)
initcond.f90:6414.25:

             r_rho(jj) = var1/unit_length
                         1
Warning: Possible change of value in conversion from REAL(8) to REAL(4) at (1)
initcond.f90:6415.27:

             lnrho_r(jj) = log(var2/unit_density)
                           1
Warning: Possible change of value in conversion from REAL(8) to REAL(4) at (1)
initcond.f90:6416.29:

             lnTT_file(jj) = log(var3/unit_temperature)
                             1
Warning: Possible change of value in conversion from REAL(8) to REAL(4) at (1)
initcond.f90:6477.18:

           bigr = var1/unit_length
                  1
Warning: Possible change of value in conversion from REAL(8) to REAL(4) at (1)
initcond.f90:6478.24:

           lnTTpoint0 = log(var2*temp_coeff/unit_temperature)
                        1
Warning: Possible change of value in conversion from REAL(8) to REAL(4) at (1)
initcond.f90:6483.25:

             r_rho(jj) = var1/unit_length
                         1
Warning: Possible change of value in conversion from REAL(8) to REAL(4) at (1)
initcond.f90:6484.27:

             lnrho_r(jj) = log(var2*dens_coeff/unit_density)
                           1
Warning: Possible change of value in conversion from REAL(8) to REAL(4) at (1)
initcond.f90:6147.30:

        do icpu=nprocy+1,ncpus
                              1
Warning: DO loop at (1) will be executed zero times
initcond.f90:6075.30:

        do icpu=nprocy+1,ncpus
                              1
Warning: DO loop at (1) will be executed zero times
initcond.f90:5973.15:

      prof_z = prof_z*1.e6/unit_length
               1
Warning: Possible change of value in conversion from REAL(8) to REAL(4) at (1)
initcond.f90:5729.28:

        do py = 1, nprocxy-1
                            1
Warning: DO loop at (1) will be executed zero times
initcond.f90:5751.29:

          do pz = 1, nprocz-1
                             1
Warning: DO loop at (1) will be executed zero times
initcond.f90:5762.11:

      Bz = Bz * 1e-4 / unit_magnetic
           1
Warning: Possible change of value in conversion from REAL(8) to REAL(4) at (1)
initcond.f90:5766.26:

          Bz_flux_local = sum(abs(Bz)) * dy * unit_magnetic*unit_length
                          1
Warning: Possible change of value in conversion from REAL(8) to REAL(4) at (1)
initcond.f90:5770.26:

          Bz_flux_local = sum(abs(Bz)) * dx * unit_magnetic*unit_length
                          1
Warning: Possible change of value in conversion from REAL(8) to REAL(4) at (1)
initcond.f90:5774.26:

          Bz_flux_local = sum(abs(Bz)) * dx*dy * unit_magnetic*unit_length**2
                          1
Warning: Possible change of value in conversion from REAL(8) to REAL(4) at (1)
initcond.f90:5591.20:

          Bzflux =  sum(abs(Bz0_r * 1e-4))*dy*unit_length
                    1
Warning: Possible change of value in conversion from REAL(8) to REAL(4) at (1)
initcond.f90:5594.20:

          Bzflux =  sum(abs(Bz0_r * 1e-4))*dx*unit_length
                    1
Warning: Possible change of value in conversion from REAL(8) to REAL(4) at (1)
initcond.f90:5597.20:

          Bzflux =  sum(abs(Bz0_r * 1e-4))*dx*unit_length*dy*unit_length
                    1
Warning: Possible change of value in conversion from REAL(8) to REAL(4) at (1)
initcond.f90:5603.14:

      Bz0_r = Bz0_r * 1e-4 / unit_magnetic ! Gauss to Tesla and SI to PENCIL un
              1
Warning: Possible change of value in conversion from REAL(8) to REAL(4) at (1)
initcond.f90:5433.15:

      prof_z = prof_z*1.e6/unit_length
               1
Warning: Possible change of value in conversion from REAL(8) to REAL(4) at (1)
boundcond.f90:8416.21:

      density_scale1=unit_length/density_scale_cgs
                     1
Warning: Possible change of value in conversion from REAL(8) to REAL(4) at (1)
boundcond.f90:8279.25:

          do j=1,nprocx-1
                         1
Warning: DO loop at (1) will be executed zero times
boundcond.f90:8302.27:

            do j=1,nprocx-1
                           1
Warning: DO loop at (1) will be executed zero times
boundcond.f90:8111.23:

        f(:,:,idz,j) = spread(ampl_forc*sin(kx*x)*cos(w_forc*t), 2, size(f,2))
                       1
Warning: Possible change of value in conversion from REAL(8) to REAL(4) at (1)
boundcond.f90:8113.23:

        f(:,:,idz,j) = spread(ampl_forc*exp(-((x-x_forc)/dx_forc)**2)*cos(w_for
                       1
Warning: Possible change of value in conversion from REAL(8) to REAL(4) at (1)
boundcond.f90:5770.24:

        do i=1,nprocxy-1
                        1
Warning: DO loop at (1) will be executed zero times
boundcond.f90:5805.16:

      time_SI = t*unit_time
                1
Warning: Possible change of value in conversion from REAL(8) to REAL(4) at (1)
boundcond.f90:5897.28:

          do py=1, nprocxy-1
                            1
Warning: DO loop at (1) will be executed zero times
boundcond.f90:5934.16:

        Bz0_l = Bz0_l * 1e-4 / unit_magnetic
                1
Warning: Possible change of value in conversion from REAL(8) to REAL(4) at (1)
boundcond.f90:5935.16:

        Bz0_r = Bz0_r * 1e-4 / unit_magnetic
                1
Warning: Possible change of value in conversion from REAL(8) to REAL(4) at (1)
boundcond.f90:5938.17:

          vx_l = vx_l / unit_velocity
                 1
Warning: Possible change of value in conversion from REAL(8) to REAL(4) at (1)
boundcond.f90:5939.17:

          vy_l = vy_l / unit_velocity
                 1
Warning: Possible change of value in conversion from REAL(8) to REAL(4) at (1)
boundcond.f90:5940.17:

          vx_r = vx_r / unit_velocity
                 1
Warning: Possible change of value in conversion from REAL(8) to REAL(4) at (1)
boundcond.f90:5941.17:

          vy_r = vy_r / unit_velocity
                 1
Warning: Possible change of value in conversion from REAL(8) to REAL(4) at (1)
boundcond.f90:5493.25:

               delta_t = t*unit_time                  ! EOF is reached => read 
                         1
Warning: Possible change of value in conversion from REAL(8) to REAL(4) at (1)
boundcond.f90:5584.15:

         uxl = uxl / 10. / unit_velocity
               1
Warning: Possible change of value in conversion from REAL(8) to REAL(4) at (1)
boundcond.f90:5585.15:

         uxr = uxr / 10. / unit_velocity
               1
Warning: Possible change of value in conversion from REAL(8) to REAL(4) at (1)
boundcond.f90:5586.15:

         uyl = uyl / 10. / unit_velocity
               1
Warning: Possible change of value in conversion from REAL(8) to REAL(4) at (1)
boundcond.f90:5587.15:

         uyr = uyr / 10. / unit_velocity
               1
Warning: Possible change of value in conversion from REAL(8) to REAL(4) at (1)
boundcond.f90:5594.16:

         uxd  = (t*unit_time - (tl+delta_t)) * (uxr - uxl) / (tr - tl) + uxl
                1
Warning: Possible change of value in conversion from REAL(8) to REAL(4) at (1)
boundcond.f90:5595.16:

         uyd  = (t*unit_time - (tl+delta_t)) * (uyr - uyl) / (tr - tl) + uyl
                1
Warning: Possible change of value in conversion from REAL(8) to REAL(4) at (1)
boundcond.f90:5204.27:

           f(l1,:,:,iuy) = spread(ampl_forc*sin(k_forc*y)*cos(w_forc*t), 2, siz
                           1
Warning: Possible change of value in conversion from REAL(8) to REAL(4) at (1)
boundcond.f90:5226.28:

            f(l2,:,:,iuy) = spread(ampl_forc*sin(k_forc*y)*cos(w_forc*t), 2, si
                            1
Warning: Possible change of value in conversion from REAL(8) to REAL(4) at (1)
boundcond.f90:4905.18:

            tau = (t-tfade_start) / (tdamp-tfade_start) - 0.5
                  1
Warning: Possible change of value in conversion from REAL(8) to REAL(4) at (1)
boundcond.f90:3303.12:

        lbc=Udrift_bc*t*dx_1(1)+1.
            1
Warning: Possible change of value in conversion from REAL(8) to REAL(4) at (1)
boundcond.f90:3317.12:

        lbc=Udrift_bc*t*dx_1(1)+1.
            1
Warning: Possible change of value in conversion from REAL(8) to REAL(4) at (1)
boundcond.f90:457.23:

          last_gettime=t
                       1
Warning: Possible change of value in conversion from REAL(8) to REAL(4) at (1)
boundcond.f90:466.26:

          last_gettime(j)=t
                          1
Warning: Possible change of value in conversion from REAL(8) to REAL(4) at (1)
boundcond.f90:472.25:

      if (.not.lget) w = (t-last_gettime(j))/timediff
                         1
Warning: Possible change of value in conversion from REAL(8) to REAL(4) at (1)
boundcond.f90:420.23:

          last_gettime=t
                       1
Warning: Possible change of value in conversion from REAL(8) to REAL(4) at (1)
boundcond.f90:424.23:

          last_gettime=t
                       1
Warning: Possible change of value in conversion from REAL(8) to REAL(4) at (1)
boundcond.f90:390.23:

          last_gettime=t
                       1
Warning: Possible change of value in conversion from REAL(8) to REAL(4) at (1)
boundcond.f90:394.23:

          last_gettime=t
                       1
Warning: Possible change of value in conversion from REAL(8) to REAL(4) at (1)
boundcond.f90:5451.42:

       integer :: lend=0,ierr,frame=0,stat,pos,iref,px,py
                                          1
Warning: Unused variable 'stat' declared at (1)
boundcond.f90:192.33:

      character(LEN=fnlen) :: dir
                                 1
Warning: Unused variable 'dir' declared at (1)
boundcond.f90:4300:0: warning: ‘bc_onesided_z_orig’ defined but not used [-Wunused-function]
     subroutine bc_onesided_z_orig(f,topbot,j)
 ^
mpif90 -O -O0 -Wall -finit-real=NaN -finit-integer=-2147483648 -g -fbacktrace -fimplicit-none -fcheck=all -ffpe-trap=invalid,zero,overflow    -std=f95 -o nochemistry.o -c nochemistry.f90
mpif90 -O -O0 -Wall -finit-real=NaN -finit-integer=-2147483648 -g -fbacktrace -fimplicit-none -fcheck=all -ffpe-trap=invalid,zero,overflow    -std=f95 -o nochiral.o -c nochiral.f90
mpif90 -O -O0 -Wall -finit-real=NaN -finit-integer=-2147483648 -g -fbacktrace -fimplicit-none -fcheck=all -ffpe-trap=invalid,zero,overflow    -std=f95 -o nocosmicray.o -c nocosmicray.f90
mpif90 -O -O0 -Wall -finit-real=NaN -finit-integer=-2147483648 -g -fbacktrace -fimplicit-none -fcheck=all -ffpe-trap=invalid,zero,overflow    -std=f95 -o nopscalar.o -c nopscalar.f90
mpif90 -O -O0 -Wall -finit-real=NaN -finit-integer=-2147483648 -g -fbacktrace -fimplicit-none -fcheck=all -ffpe-trap=invalid,zero,overflow    -std=f95 -o noneutraldensity.o -c noneutraldensity.f90
mpif90 -O -O0 -Wall -finit-real=NaN -finit-integer=-2147483648 -g -fbacktrace -fimplicit-none -fcheck=all -ffpe-trap=invalid,zero,overflow    -std=f95 -o nopolymer.o -c nopolymer.f90
mpif90 -O -O0 -Wall -finit-real=NaN -finit-integer=-2147483648 -g -fbacktrace -fimplicit-none -fcheck=all -ffpe-trap=invalid,zero,overflow    -std=f95 -o noradiation.o -c noradiation.f90
mpif90 -O -O0 -Wall -finit-real=NaN -finit-integer=-2147483648 -g -fbacktrace -fimplicit-none -fcheck=all -ffpe-trap=invalid,zero,overflow    -std=f95 -o noascalar.o -c noascalar.f90
nochemistry.f90:201.30:

    subroutine get_cs2_slice(f,slice,index,dir)
                              1
Warning: Unused dummy argument 'f' at (1)
nochemistry.f90:185.32:

    subroutine get_gamma_slice(f,slice,index,dir)
                                1
Warning: Unused dummy argument 'f' at (1)
nochemistry.f90:168.30:

    subroutine get_mu1_slice(f,slice,grad_slice,index,sgn,direction)
                              1
Warning: Unused dummy argument 'f' at (1)
mpif90 -O -O0 -Wall -finit-real=NaN -finit-integer=-2147483648 -g -fbacktrace -fimplicit-none -fcheck=all -ffpe-trap=invalid,zero,overflow    -std=f95 -o noneutralvelocity.o -c noneutralvelocity.f90
mpif90 -O -O0 -Wall -finit-real=NaN -finit-integer=-2147483648 -g -fbacktrace -fimplicit-none -fcheck=all -ffpe-trap=invalid,zero,overflow    -std=f95 -o nocosmicrayflux.o -c nocosmicrayflux.f90
mpif90 -O -O0 -Wall -finit-real=NaN -finit-integer=-2147483648 -g -fbacktrace -fimplicit-none -fcheck=all -ffpe-trap=invalid,zero,overflow    -std=f95 -o nolsode_for_chemistry.o -c nolsode_for_chemistry.f90
mpif90 -O -O0 -Wall -finit-real=NaN -finit-integer=-2147483648 -g -fbacktrace -fimplicit-none -fcheck=all -ffpe-trap=invalid,zero,overflow    -std=f95 -o experimental/boussinesq.o -c experimental/boussinesq.f90
mpif90 -O -O0 -Wall -finit-real=NaN -finit-integer=-2147483648 -g -fbacktrace -fimplicit-none -fcheck=all -ffpe-trap=invalid,zero,overflow    -std=f95 -o nodetonate.o -c nodetonate.f90
mpif90 -O -O0 -Wall -finit-real=NaN -finit-integer=-2147483648 -g -fbacktrace -fimplicit-none -fcheck=all -ffpe-trap=invalid,zero,overflow    -std=f95 -o viscosity.o -c viscosity.f90
mpif90 -O -O0 -Wall -finit-real=NaN -finit-integer=-2147483648 -g -fbacktrace -fimplicit-none -fcheck=all -ffpe-trap=invalid,zero,overflow    -std=f95 -o noimplicit_physics.o -c noimplicit_physics.f90
mpif90 -O -O0 -Wall -finit-real=NaN -finit-integer=-2147483648 -g -fbacktrace -fimplicit-none -fcheck=all -ffpe-trap=invalid,zero,overflow    -std=f95 -o filter.o -c filter.f90
mpif90 -O -O0 -Wall -finit-real=NaN -finit-integer=-2147483648 -g -fbacktrace -fimplicit-none -fcheck=all -ffpe-trap=invalid,zero,overflow    -std=f95 -o noNSCBC.o -c noNSCBC.f90
filter.f90:274:0: warning: ‘rmwig_lnxyaverage’ defined but not used [-Wunused-function]
     subroutine rmwig_lnxyaverage(f,ivar)
 ^
filter.f90:146:0: warning: ‘rmwig_old’ defined but not used [-Wunused-function]
     subroutine rmwig_old(f,df,ivar,explog)
 ^
experimental/boussinesq.f90:780:0: warning: ‘push2c’ defined but not used [-Wunused-function]
     subroutine push2c(p_par)
 ^
viscosity.f90:2574.59:

    subroutine get_viscosity_implicit(ndc, diffus_coeff, iz)
                                                           1
Warning: Unused dummy argument 'iz' at (1)
viscosity.f90:2574:0: warning: ‘get_viscosity_implicit’ defined but not used [-Wunused-function]
     subroutine get_viscosity_implicit(ndc, diffus_coeff, iz)
 ^
mpif90 -O -O0 -Wall -finit-real=NaN -finit-integer=-2147483648 -g -fbacktrace -fimplicit-none -fcheck=all -ffpe-trap=invalid,zero,overflow    -std=f95 -o nodustvelocity.o -c nodustvelocity.f90
mpif90 -O -O0 -Wall -finit-real=NaN -finit-integer=-2147483648 -g -fbacktrace -fimplicit-none -fcheck=all -ffpe-trap=invalid,zero,overflow    -std=f95 -o nodustdensity.o -c nodustdensity.f90
mpif90 -O -O0 -Wall -finit-real=NaN -finit-integer=-2147483648 -g -fbacktrace -fimplicit-none -fcheck=all -ffpe-trap=invalid,zero,overflow    -std=f95 -o temperature_idealgas.o -c temperature_idealgas.f90
mpif90 -O -O0 -Wall -finit-real=NaN -finit-integer=-2147483648 -g -fbacktrace -fimplicit-none -fcheck=all -ffpe-trap=invalid,zero,overflow    -std=f95 -o noforcing.o -c noforcing.f90
mpif90 -O -O0 -Wall -finit-real=NaN -finit-integer=-2147483648 -g -fbacktrace -fimplicit-none -fcheck=all -ffpe-trap=invalid,zero,overflow    -std=f95 -o nomagnetic.o -c nomagnetic.f90
nomagnetic.f90:292:0: warning: ‘bdry_magnetic’ defined but not used [-Wunused-function]
     subroutine bdry_magnetic(f,quench,task)
 ^
mpif90 -O -O0 -Wall -finit-real=NaN -finit-integer=-2147483648 -g -fbacktrace -fimplicit-none -fcheck=all -ffpe-trap=invalid,zero,overflow    -std=f95 -o hydro.o -c hydro.f90
ar r magnetic.a nomagnetic.o magnetic/nomeanfield.o magnetic/nomeanfield_demfdt.o
ar: creating magnetic.a
temperature_idealgas.f90:2260.12:

       a0=  3.68132d-27
            1
Warning: Change of value in conversion from  REAL(8) to REAL(4) at (1)
temperature_idealgas.f90:2265.12:

       a0=  5.69305d-26
            1
Warning: Change of value in conversion from  REAL(8) to REAL(4) at (1)
temperature_idealgas.f90:2270.12:

       a0=  1.29671d-24
            1
Warning: Change of value in conversion from  REAL(8) to REAL(4) at (1)
temperature_idealgas.f90:2275.12:

       a0=  5.42492d-25
            1
Warning: Change of value in conversion from  REAL(8) to REAL(4) at (1)
temperature_idealgas.f90:2280.12:

       a0=  1.71252d-25
            1
Warning: Change of value in conversion from  REAL(8) to REAL(4) at (1)
temperature_idealgas.f90:2285.12:

       a0=  4.26987d-25
            1
Warning: Change of value in conversion from  REAL(8) to REAL(4) at (1)
temperature_idealgas.f90:2290.12:

       a0=  6.38811d-27
            1
Warning: Change of value in conversion from  REAL(8) to REAL(4) at (1)
temperature_idealgas.f90:2297.12:

       a0=  2.72928d-25
            1
Warning: Change of value in conversion from  REAL(8) to REAL(4) at (1)
temperature_idealgas.f90:1822.15:

        kappa0=kappa0_cgs*unit_density*unit_length
               1
Warning: Possible change of value in conversion from REAL(8) to REAL(4) at (1)
temperature_idealgas.f90:1845.18:

        cooling = 2*sigmaSB*p%rho1*p%TT**4/(a1+a2+a3)
                  1
Warning: Possible change of value in conversion from REAL(8) to REAL(4) at (1)
temperature_idealgas.f90:1456.23:

          NN2_resp   = (6./7.*p%rho/m_p*unit_density/unit_mass)**2.
                       1
Warning: Possible change of value in conversion from REAL(8) to REAL(4) at (1)
temperature_idealgas.f90:1460.22:

          logT_resp  =log10(p%TT*unit_temperature)
                      1
Warning: Possible change of value in conversion from REAL(8) to REAL(4) at (1)
temperature_idealgas.f90:1465.76:

             call zsum_mn_name_xy(resp*Lz*unit_length/1e6,idiag_EmAIA94mxy)
                                                                           1
Error: There is no specific subroutine for the generic 'zsum_mn_name_xy' at (1)
temperature_idealgas.f90:1468.35:

              call ysum_mn_name_xz(resp*Ly*unit_length/1e6,idiag_EmAIA94mxz)
                                   1
Error: Type mismatch in argument 'a' at (1); passed REAL(8) to REAL(4)
temperature_idealgas.f90:1475.77:

            call zsum_mn_name_xy(resp*Lz*unit_length/1e6,idiag_EmAIA131mxy)
                                                                           1
Error: There is no specific subroutine for the generic 'zsum_mn_name_xy' at (1)
temperature_idealgas.f90:1478.35:

              call ysum_mn_name_xz(resp*Ly*unit_length/1e6,idiag_EmAIA131mxz)
                                   1
Error: Type mismatch in argument 'a' at (1); passed REAL(8) to REAL(4)
temperature_idealgas.f90:1485.77:

            call zsum_mn_name_xy(resp*Lz*unit_length/1e6,idiag_EmAIA171mxy)
                                                                           1
Error: There is no specific subroutine for the generic 'zsum_mn_name_xy' at (1)
temperature_idealgas.f90:1488.35:

              call ysum_mn_name_xz(resp*Ly*unit_length/1e6,idiag_EmAIA171mxz)
                                   1
Error: Type mismatch in argument 'a' at (1); passed REAL(8) to REAL(4)
temperature_idealgas.f90:1495.77:

            call zsum_mn_name_xy(resp*Lz*unit_length/1e6,idiag_EmAIA193mxy)
                                                                           1
Error: There is no specific subroutine for the generic 'zsum_mn_name_xy' at (1)
temperature_idealgas.f90:1498.35:

              call ysum_mn_name_xz(resp*Ly*unit_length/1e6,idiag_EmAIA193mxz)
                                   1
Error: Type mismatch in argument 'a' at (1); passed REAL(8) to REAL(4)
temperature_idealgas.f90:1505.77:

            call zsum_mn_name_xy(resp*Lz*unit_length/1e6,idiag_EmAIA211mxy)
                                                                           1
Error: There is no specific subroutine for the generic 'zsum_mn_name_xy' at (1)
temperature_idealgas.f90:1508.35:

              call ysum_mn_name_xz(resp*Ly*unit_length/1e6,idiag_EmAIA211mxz)
                                   1
Error: Type mismatch in argument 'a' at (1); passed REAL(8) to REAL(4)
temperature_idealgas.f90:1515.77:

            call zsum_mn_name_xy(resp*Lz*unit_length/1e6,idiag_EmAIA304mxy)
                                                                           1
Error: There is no specific subroutine for the generic 'zsum_mn_name_xy' at (1)
temperature_idealgas.f90:1518.35:

              call ysum_mn_name_xz(resp*Ly*unit_length/1e6,idiag_EmAIA304mxz)
                                   1
Error: Type mismatch in argument 'a' at (1); passed REAL(8) to REAL(4)
temperature_idealgas.f90:1525.77:

            call zsum_mn_name_xy(resp*Lz*unit_length/1e6,idiag_EmAIA335mxy)
                                                                           1
Error: There is no specific subroutine for the generic 'zsum_mn_name_xy' at (1)
temperature_idealgas.f90:1528.35:

              call ysum_mn_name_xz(resp*Ly*unit_length/1e6,idiag_EmAIA335mxz)
                                   1
Error: Type mismatch in argument 'a' at (1); passed REAL(8) to REAL(4)
temperature_idealgas.f90:1535.74:

              call zsum_mn_name_xy(resp*Lz*unit_length/1e6,idiag_EmXRTmxy)
                                                                          1
Error: There is no specific subroutine for the generic 'zsum_mn_name_xy' at (1)
temperature_idealgas.f90:1538.35:

              call ysum_mn_name_xz(resp*Ly*unit_length/1e6,idiag_EmXRTmxz)
                                   1
Error: Type mismatch in argument 'a' at (1); passed REAL(8) to REAL(4)
make[2]: *** [temperature_idealgas.o] Error 1
make[2]: *** Waiting for unfinished jobs....
hydro.f90:4396.23:

              last_t = t
                       1
Warning: Possible change of value in conversion from REAL(8) to REAL(4) at (1)
hydro.f90:4418.20:

              tau = (t-tfade_start) / (tdamp-tfade_start) - 0.5
                    1
Warning: Possible change of value in conversion from REAL(8) to REAL(4) at (1)
hydro.f90:3779.10:

        c=cos(omega_precession*t)
          1
Warning: Possible change of value in conversion from REAL(8) to REAL(4) at (1)
hydro.f90:3780.10:

        s=sin(omega_precession*t)
          1
Warning: Possible change of value in conversion from REAL(8) to REAL(4) at (1)
hydro.f90:3399.15:

          kx = kx_uu + qshear*Omega*ky_uu*t
               1
Warning: Possible change of value in conversion from REAL(8) to REAL(4) at (1)
hydro.f90:4294:0: warning: ‘coriolis_cylindrical_del2p’ defined but not used [-Wunused-function]
     subroutine coriolis_cylindrical_del2p(f,p)
 ^
hydro.f90:4200:0: warning: ‘coriolis_spherical_del2p’ defined but not used [-Wunused-function]
     subroutine coriolis_spherical_del2p(f,p)
 ^
make[2]: Leaving directory `/home/pencil/daily-test/samples/2d-tests/boussinesq_convection/src'
make[1]: *** [code] Error 2
make[1]: Leaving directory `/home/pencil/daily-test/samples/2d-tests/boussinesq_convection/src'
make: *** [default_to_be] Error 2
'make -j FFLAGS_DOUBLE=-fdefault-real-8 -fdefault-double-8 CFLAGS_DOUBLE=-DDOUBLE_PRECISION LD_MPI= CFLAGS_FFTW3= FFLAGS_FFTW3= LD_FFTW3= CFLAGS_FFTW2= FFLAGS_FFTW2= LD_FFTW2= FC=mpif90 F77=mpif77 FFLAGS=-O -O0 -Wall -finit-real=NaN -finit-integer=-2147483648 -g -fbacktrace -fimplicit-none -fcheck=all -ffpe-trap=invalid,zero,overflow LDFLAGS_HELPER=-dynamic FSTD_95=-std=f95 FSTD_2003=-std=f2003 CC=mpicc CFLAGS=-DFUNDERSC=1 default_to_be' failed: <> ['\nice -n 15 pc_build --config-files=GNU-GCC_MPI+GNU-GCC_debug ' reported: ]

daily-test/samples/conv-slab: (64/71)
    Compiling..            [double]           ok        00:02
    Starting..                                ok        00:01
    Running..                                 ok        00:58
    Validating results..                      ok      
    Time used:                                        01:02 = 00:02 + 00:59

daily-test/samples/interlocked-fluxrings: (65/71)
    Compiling..            [double]           ok        00:02
    Starting..                                ok        00:01
    Running..                                 ok        01:38
    Validating results..                      ok      
    Time used:                                        01:43 = 00:02 + 01:40

daily-test/samples/conv-slab-flat: (66/71)
    Compiling..                               ok        01:24
    Starting..                                ok        00:00
    Running..                                 ok        00:50
    Validating results..                      ok      
    Time used:                                        02:15 = 01:24 + 00:50

daily-test/samples/coronae_heatflux_boris: (67/71)
    Compiling..                               ok        00:02
    Starting..                                ok        00:01
    Running..                                 ok        00:22
    Validating results..                      ok      
    Time used:                                        00:27 = 00:02 + 00:24

daily-test/samples/testfield: (68/71)
    Compiling..                               ok        01:17
    Starting..                                ok        00:01
    Running..                                 ok        00:05
    Validating results..                      ok      
    Time used:                                        01:24 = 01:17 + 00:07

daily-test/samples/testfield_nonlin_z: (69/71)
    Compiling..                               ok        00:02
    Starting..                                ok        00:01
    Running..                                 ok        08:25
    Validating results..                      ok      
    Time used:                                        08:29 = 00:02 + 08:27

daily-test/samples/spherical-convection: (70/71)
    Compiling..                               ok        00:02
    Starting..                                ok        00:01
    Running..                                 ok        00:16
    Validating results..                      ok      
    Time used:                                        00:21 = 00:02 + 00:18

daily-test/samples/spherical-convection-corona: (71/71)
    Compiling..                               ok        00:03
    Starting..                                ok        00:01
    Running..                                 ok        00:50
    Validating results..                      ok      
    Time used:                                        00:54 = 00:03 + 00:51

----------------------------------------------------------------------
### auto-test failed ###
Failed 1 test(s) out of 71:
CPU time (including compilation):   58:40u 02:58s
Total wall-clock time:            01:05:17 = 23:59 + 40:21

----------------------------------------------------------------------
The following configuration has been used:
$config = {
            'runtime' => {
                           'mpiexec_opts' => '',
                           'mpiexec' => 'mpiexec',
                           'mpiexec_opts2' => ''
                         },
            'environment' => {
                               'MODULE_INFIX' => '_MOD_',
                               'MODULE_SUFFIX' => '',
                               'MODULE_PREFIX' => '__'
                             },
            'makefile' => {
                            'FFLAGS_FFTW2' => '',
                            'FFLAGS_FFTW3' => '',
                            'F77' => 'mpif77',
                            'FSTD_2003' => '-std=f2003',
                            'CFLAGS_FFTW3' => '',
                            'CFLAGS_FFTW2' => '',
                            'FFLAGS' => '-O -O0 -Wall -finit-real=NaN -finit-integer=-2147483648 -g -fbacktrace -fimplicit-none -fcheck=all -ffpe-trap=invalid,zero,overflow',
                            'CC' => 'mpicc',
                            'LD_FFTW3' => '',
                            'CFLAGS_DOUBLE' => '-DDOUBLE_PRECISION',
                            'CFLAGS' => '-DFUNDERSC=1',
                            'LD_MPI' => '',
                            'FFLAGS_DOUBLE' => '-fdefault-real-8 -fdefault-double-8',
                            'MAKE_VAR1' => '-j',
                            'LD_FFTW2' => '',
                            'FC' => 'mpif90',
                            'FSTD_95' => '-std=f95',
                            'LDFLAGS_HELPER' => '-dynamic'
                          }
          };
Perl version v5.18.2
Wed Jul 17 01:05:24 2019