Mon Jul 24 00:13:05 2017

bin/pencil-test --use-pc_auto-test --auto-test-options='--max-level=3,--config-files=GNU-GCC_MPI+GNU-GCC_debug' --pencil-home='/home/pencil/daily-test' --nice=15 --clean --short --local --html

Lorraine:


daily-test/samples/no-modules: (1/69)
    Compiling..            [double]           ok        00:46
    Starting..                                ok        00:00
    Running..                                 ok        00:00
    Validating results..                      ok      
    Time used:                                        00:47 = 00:46 + 00:00

daily-test/samples/most-modules: (2/69)
    Compiling..                               ok        01:55
    Starting..                                ok        00:01
    Running..                                 not ok:   00:03
hostname = lorraine.pab-software.de
Non-MPI run
1 CPU
lparticles = 1
lpointmasses = 1
Subcommand: run
Revision: Last Changed Rev: 74808
Mon Jul 24 00:15:49 2017
Running 'env MODULE_PREFIX=__ MODULE_INFIX=_MOD_ MODULE_SUFFIX= ./src/run.x'...
SVN: -------            v.         (                   ) $Id$
SVN: -------            v.         (                   ) $Id$               
SVN: -------            v.         (                   ) $Id$               
SVN: -------            v.         (                   ) $Id$
SVN: -------            v.         (                   ) $Id$
SVN: -------            v.         (                   ) $Id$
SVN: -------            v.         (                   ) $Id$
SVN: -------            v.         (                   ) $Id$
SVN: -------            v.         (                   ) $Id$
SVN: -------            v.         (                   ) $Id$
SVN: -------            v.         (                   ) $Id$
SVN: -------            v.         (                   ) $Id$
SVN: -------            v.         (                   ) $Id$
SVN: -------            v.         (                   ) $Id$
SVN: -------            v.         (                   ) $Id$
SVN: -------            v.         (                   ) $Id$
SVN: -------            v.         (                   ) $Id$
SVN: -------            v.         (                   ) $Id$
SVN: -------            v.         (                   ) $Id$
SVN: -------            v.         (                   ) $Id$
SVN: -------            v.         (                   ) $Id$
SVN: -------            v.         (                   ) $Id$
SVN: -------            v.         (                   ) $Id$
SVN: -------            v.         (                   ) $Id$
SVN: -------            v.         (                   ) $Id$
SVN: -------            v.         (                   ) $Id$
SVN: -------            v.         (                   ) $Id$
SVN: -------            v.         (                   ) $Id$
SVN: -------            v.         (                   ) $Id$
SVN: -------            v.         (                   ) $Id$
SVN: -------            v.         (                   ) $Id$
SVN: -------            v.         (                   ) $Id$
SVN: -------            v.         (                   ) $Id$
SVN: -------            v.         (                   ) $Id$
SVN: -------            v.         (                   ) $Id$
SVN: -------            v.         (                   ) $Id$
SVN: -------            v.         (                   ) $Id$
SVN: -------            v.         (                   ) $Id$
SVN: -------            v.         (                   ) $Id$
SVN: -------            v.         (                   ) $Id$
 The verbose level is ip=          14  (ldebug= F )
 This is a 3-D run
 nxgrid, nygrid, nzgrid=          32          32          32
 Lx, Ly, Lz=   6.28318548       6.28318548       6.28318548    
       Vbox=   248.050232    
WARNING:  input_persistent_interstellar: t_next_SNI from run.in overwritten. Set l_persist_overwrite_tSNI=T to update
 input_persistent_interstellar: lSNI T t_next_SNI   0.00000000E+00
 input_persistent_interstellar: lSNII T t_next_SNII   0.00000000E+00
WARNING:  input_persistent_interstellar: t_next_SNII from run.in overwritten. Set l_persist_overwrite_tSNII=T to update
 input_persistent_interstellar: lSNI T t_next_SNI   0.00000000E+00
 input_persistent_interstellar: lSNII T t_next_SNII   0.00000000E+00
WARNING:  input_persistent_interstellar: x_cluster from run.in overwritten. Set l_persist_overwrite_xcluster=T to update
 input_persistent_interstellar: lSNI T t_next_SNI   0.00000000E+00
 input_persistent_interstellar: lSNII T t_next_SNII   0.00000000E+00
WARNING:  input_persistent_interstellar: y_cluster from run.in overwritten. Set l_persist_overwrite_ycluster=T to update
 input_persistent_interstellar: lSNI T t_next_SNI   0.00000000E+00
 input_persistent_interstellar: lSNII T t_next_SNII   0.00000000E+00
WARNING:  input_persistent_interstellar: z_cluster from run.in overwritten. Set l_persist_overwrite_zcluster=T to update
 input_persistent_interstellar: lSNI T t_next_SNI   0.00000000E+00
 input_persistent_interstellar: lSNII T t_next_SNII   0.00000000E+00
WARNING:  input_persistent_interstellar: t_cluster from run.in overwritten. Set l_persist_overwrite_tcluster=T to update
 input_persistent_interstellar: lSNI T t_next_SNI   0.00000000E+00
 input_persistent_interstellar: lSNII T t_next_SNII   0.00000000E+00
WARNING:  input_persistent_interstellar: lSNI from run.in overwritten. Set l_persist_overwrite_lSNI=T to update
 input_persistent_interstellar: lSNI T t_next_SNI   0.00000000E+00
 input_persistent_interstellar: lSNII T t_next_SNII   0.00000000E+00
WARNING:  input_persistent_interstellar: lSNII from run.in overwritten. Set l_persist_overwrite_lSNII=T to update
 input_persistent_interstellar: lSNI T t_next_SNI   0.00000000E+00
 input_persistent_interstellar: lSNII T t_next_SNII   0.00000000E+00
 input_persistent_interstellar: lSNI T t_next_SNI   0.00000000E+00
 input_persistent_interstellar: lSNII T t_next_SNII   0.00000000E+00
 input_persistent_forcing:    0.00000000E+00   0.00000000E+00   0.00000000E+00  -10.0000000    
 input_persistent_interstellar: lSNI T t_next_SNI   0.00000000E+00
 input_persistent_interstellar: lSNII T t_next_SNII   0.00000000E+00
 input_persistent_forcing:    0.00000000E+00   0.00000000E+00   0.00000000E+00  -10.0000000    
 units_general: unit_velocity=   97781.229948950713     
 units_general: unit_density=   1.0000000000000003E-024
 units_general: unit_length=   3.0856775799999997E+021
 units_general: unit_magnetic=   3.5449078083038330     
 (x,y,z)(point)=  -9.81745720E-02  -9.81745720E-02  -9.81745720E-02
 (x,y,z)(point2)=  -2.06167030      -2.06167030      -2.06167030    
 initialize_eos: ENTER
 initialize_gravity: no x-gravity
 initialize_gravity: no y-gravity
 initialize_gravity: constant gravz=   0.00000000E+00
 diffusion: nothing (i.e. no mass diffusion)
 initialize_energy: cs2top,cs2cool=   3.90849994E+37   0.00000000E+00
 initialize_energy: now set cs2cool=cs2top
 initialize_energy: nheatc_max,iheatcond=           4 nothing                  nothing                  nothing                  nothing                  
 heat conduction: nothing
 resistivity: constant eta
WARNING:  initialize_magnetic: Resistivity coefficient eta is zero!
 lalpha_aniso= F
 lalpha_tensor= F
 initialize_magn_mf: lweyl_gauge= F
 calc_angle_weights: correction_factor =  0.333333343    
 initialize_radiation: ndir =           2
 initialize_dustvelocity: dust_chemistry = nothing                  
 recalculated: md0=   1.00000000    
 initialize_dustvelocity: ad=  0.620350480    
 initialize_dustvelocity: doing nothing
 initialize_dustvelocity: dust geometry = sphere
 initialize_dustdensity: ldustcoagulation,ldustcondensation = F F
 initialize_dustdensity: ldustcoagulation_simplified,ldustcondensation_simplified = F F
 initialize_dustdensity: ldustcoagulation,ldustcondensation = F F
 advec_ddensity: plain vanilla scheme
 initialize_dustdensity: diffnd=   0.00000000E+00
 dust diffusion: nothing
 gammacr1=  0.333333373    
WARNING:  initialize_cosmicray: using obsolescent parameters Kpara and Kperp! In the future, please use K_para and K_perp instead.
WARNING:  initialize_cosmicrayflux: parameter tau was set to zero!
WARNING:  initialize_cosmicrayflux: using obsolescent parameters kpara and kperp!Please set K_para/K_perp at the Cosmicray module instead.
 initialize_interstellar: t_next_SNI   0.00000000E+00
 initialize_interstellar: solar_mass (code) =   6.76991405E-08
 initialize_interstellar: eampl_SN, kampl_SN =    0.00000000E+00   0.00000000E+00
 initialize_interstellar: WSW cooling fct
 initialize_interstellar: unit_Lambda   3.02981390E+17
 initialize_interstellar: unit_Gamma   3.02981391E-07
 initialize_interstellar: t_interval_SNI =   6.33390619E-06   6.28318548       6.28318548       3999.15820    
 initialize_interstellar: average_SNI_heating =   24711.742202248974     
 initialize_interstellar: average_SNII_heating =   669276.37041635951     
 initialize_interstellar: t_next_SNI, t_next_SNII=   0.00000000E+00   0.00000000E+00
 initialize_shock: prenormalised shock_factor sum=   1.00000000    
 initialize_particles: dust-to-gas ratio eps_dtog=   1.00000000    
 initialize_particles: mass per constituent particle mpmat=   0.00000000E+00
 initialize_particles: mass per superparticle mp_swarm =   9.66383964E-02
 initialize_particles: number density per superparticle np_swarm=   0.00000000E+00
 initialize_particles: mass density per superparticle rhop_swarm=   12.7661524    
 initialize particles: set minimum collisional time-scale equal to two times the Courant time-step.
 initialize_particles_map: selected cloud-in-cell for particle-mesh method. 
 initialize_particles_radius: mass per dust grain mpmat=   0.00000000E+00
 pencil_consistency_check: checking pencil case
 dnpswarm_dt_pencil: Calculate dnpswarm_dt
At line 269 of file particles_selfgravity.f90 dxxp_dt: Calculate dxxp_dt
 dxxp_dt: Particles boundary condition bcpx=p      
 dxxp_dt: Particles boundary condition bcpy=p      
 dxxp_dt: Particles boundary condition bcpz=p      
 dxxp_dt: Set rate of change of particle position equal to particle velocity.
 dvvp_dt: Calculate dvvp_dt
 dvvp_dt: Calculating gravity
 dvvp_dt: No gravity in x-direction.
 dvvp_dt: No gravity in z-direction.
 dvvp_dt: No radial gravity
 dvvp_dt_selfgrav: add self-gravity

Fortran runtime warning: An array temporary was created for argument 'xxp' of procedure 'interpolate_linear_range'
At line 269 of file particles_selfgravity.f90
Fortran runtime warning: An array temporary was created for argument 'inear' of procedure 'interpolate_linear_range'
At line 1020 of file pointmasses.f90 dvvp_dt_pointmasses: Calculate dvvp_dt_pointmasses

Fortran runtime warning: An array temporary was created for argument 'xxq' of procedure 'get_evr'
At line 978 of file pointmasses.f90 dvvp_dt_pointmasses: Finished dvvp_dt_pointmasses

Fortran runtime warning: An array temporary was created for argument 'fp_pt' of procedure 'gravity_pointmasses'
At line 978 of file pointmasses.f90
Fortran runtime warning: An array temporary was created for argument 'dfp_pt' of procedure 'gravity_pointmasses'
 pencil_consistency_check: checking requested pencils
 pencil_consistency_check: performing small pencil check
At line 2471 of file hydro.f90
Fortran runtime warning: An array temporary was created for argument 'gradf' of procedure 'h_dot_grad_scl'
At line 2829 of file magnetic.f90
Fortran runtime warning: An array temporary was created for argument 'gradf' of procedure 'h_dot_grad_scl'

Program received signal SIGFPE: Floating-point exception - erroneous arithmetic operation.

Backtrace for this error:
#0  0x7FB5AFC9B777
#1  0x7FB5AFC9BD7E
#2  0x7FB5AF1B5CAF
#3  0x7FB5AF9A8F28
#4  0x7FB5AF9AFA41
#5  0x501AB1 in __dustdensity_MOD_calc_pencils_dustdensity at dustdensity.f90:1546 (discriminator 2)
#6  0x1346D6B in rhs_cpu at equ.f90:799
#7  0x134921B in __equ_MOD_pde at equ.f90:335
#8  0x135567E in __pencil_check_MOD_pencil_consistency_check at pencil_check.f90:206 (discriminator 2)
#9  0x136217A in run at run.f90:524
'env MODULE_PREFIX=__ MODULE_INFIX=_MOD_ MODULE_SUFFIX= ./src/run.x' failed: 
Aborting. ['\nice -n 15 pc_run --config-files=GNU-GCC_MPI+GNU-GCC_debug run' reported: ]
 not ok: 
Floating-point exception.

daily-test/samples/backwards-compatible: (3/69)
    Compiling..                               ok        01:19
    Starting..                                ok        00:00
    Running..                                 ok        00:00
    Validating results..                      ok      
    Time used:                                        01:20 = 01:19 + 00:00

daily-test/samples/1d-tests/implicit_diffusion: (4/69)
    Compiling..                               ok        00:53
    Starting..                                ok        00:00
    Running..                                 ok        00:00
    Validating results..                      ok      
    Time used:                                        00:54 = 00:53 + 00:00

daily-test/samples/2d-tests/chemistry_GrayScott: (5/69)
    Compiling..                               ok        00:51
    Starting..                                ok        00:00
    Running..                                 ok        00:05
    Validating results..                      ok      
    Time used:                                        00:56 = 00:51 + 00:05

daily-test/samples/2d-tests/boussinesq_convection: (6/69)
    Compiling..                               ok        00:57
    Starting..                                ok        00:00
    Running..                                 ok        00:00
    Validating results..                      ok      
    Time used:                                        00:59 = 00:57 + 00:01

daily-test/samples/2d-tests/selfgravitating-shearwave: (7/69)
    Compiling..                               ok        01:03
    Starting..                                ok        00:02
    Running..                                 ok        00:10
    Validating results..                      ok      
    Time used:                                        01:16 = 01:03 + 00:12

daily-test/samples/2d-tests/shearwave-dust-par: (8/69)
    Compiling..                               ok        01:08
    Starting..                                ok        00:01
    Running..                                 ok        00:17
    Validating results..                      ok      
    Time used:                                        01:27 = 01:08 + 00:18

daily-test/samples/0d-tests/heating_ionize: (9/69)
    Compiling..            [double]           ok        00:50
    Starting..                                not ok:   00:00
hostname = lorraine.pab-software.de
Non-MPI run
1 CPU
lparticles = 0
lpointmasses = 0
Subcommand: start
Revision: Last Changed Rev: 74808
Mon Jul 24 00:23:37 2017
Running 'env MODULE_PREFIX=__ MODULE_INFIX=_MOD_ MODULE_SUFFIX= ./src/start.x'...
SVN: -------            v.         (                   ) $Id$
SVN: -------            v.         (                   ) $Id$               
SVN: -------            v.         (                   ) $Id$
SVN: -------            v.         (                   ) $Id$
SVN: -------            v.         (                   ) $Id$
SVN: -------            v.         (                   ) $Id$
SVN: -------            v.         (                   ) $Id$
SVN: -------            v.         (                   ) $Id$
SVN: -------            v.         (                   ) $Id$
SVN: -------            v.         (                   ) $Id$
SVN: -------            v.         (                   ) $Id$
SVN: -------            v.         (                   ) $Id$
SVN: -------            v.         (                   ) $Id$
SVN: -------            v.         (                   ) $Id$
SVN: -------            v.         (                   ) $Id$
SVN: -------            v.         (                   ) $Id$
SVN: -------            v.         (                   ) $Id$
SVN: -------            v.         (                   ) $Id$
SVN: -------            v.         (                   ) $Id$
SVN: -------            v.         (                   ) $Id$
SVN: -------            v.         (                   ) $Id$
SVN: -------            v.         (                   ) $Id$
SVN: -------            v.         (                   ) $Id$
SVN: -------            v.         (                   ) $Id$
SVN: -------            v.         (                   ) $Id$
SVN: -------            v.         (                   ) $Id$
SVN: -------            v.         (                   ) $Id$
SVN: -------            v.         (                   ) $Id$
SVN: -------            v.         (                   ) $Id$
SVN: -------            v.         (                   ) $Id$
SVN: -------            v.         (                   ) $Id$
At line 1412 of file diagnostics.f90
Fortran runtime error: Bad integer for item 1 in list input
'env MODULE_PREFIX=__ MODULE_INFIX=_MOD_ MODULE_SUFFIX= ./src/start.x' failed: 
Aborting. ['\nice -n 15 pc_run --config-files=GNU-GCC_MPI+GNU-GCC_debug start' reported: ]
    Time used:                                        undef = 00:50 + undef

daily-test/samples/dust-vortex: (10/69)
    Compiling..                               ok        01:28
    Starting..                                ok        00:00
    Running..                                 ok        00:38
    Validating results..                      ok      
    Time used:                                        02:07 = 01:28 + 00:38

daily-test/samples/damped_alfven_waves: (11/69)
    Compiling..                               ok        01:18
    Starting..                                ok        00:01
    Running..                                 ok        01:41
    Validating results..                      ok      
    Time used:                                        03:01 = 01:18 + 01:43

daily-test/samples/2d-tests/streaming_instability: (12/69)
    Compiling..                               ok        01:08
    Starting..                                ok        00:01
    Running..                                 ok        00:50
    Validating results..                      ok      
    Time used:                                        02:00 = 01:08 + 00:52

daily-test/samples/0d-tests/heating_noionize: (13/69)
    Compiling..                               ok        00:52
    Starting..                                ok        00:00
    Running..                                 ok        00:00
    Validating results..                      ok      
    Time used:                                        00:53 = 00:52 + 00:00

daily-test/samples/1d-tests/H2_flamespeed: (14/69)
    Compiling..                               ok        00:58
    Starting..                                ok        00:00
    Running..                                 ok        00:04
    Validating results..                      ok      
    Time used:                                        01:02 = 00:58 + 00:04

daily-test/samples/chiral-diffusion: (15/69)
    Compiling..                               ok        00:43
    Starting..                                ok        00:00
    Running..                                 ok        00:00
    Validating results..                      ok      
    Time used:                                        00:43 = 00:43 + 00:00

daily-test/samples/cosmicray: (16/69)
    Compiling..                               ok        00:51
    Starting..                                ok        00:00
    Running..                                 ok        00:00
    Validating results..                      ok      
    Time used:                                        00:52 = 00:51 + 00:00

daily-test/samples/1d-tests/sod_10: (17/69)
    Compiling..                               ok        00:54
    Starting..                                ok        00:00
    Running..                                 ok        00:00
    Validating results..                      ok      
    Time used:                                        00:55 = 00:54 + 00:01

daily-test/samples/1d-tests/ambipolar_diffusion: (18/69)
    Compiling..                               ok        00:58
    Starting..                                ok        00:00
    Running..                                 ok        00:05
    Validating results..                      ok      
    Time used:                                        01:04 = 00:58 + 00:06

daily-test/samples/helical-MHDturb: (19/69)
    Compiling..                               ok        01:32
    Starting..                                ok        00:00
    Running..                                 ok        01:29
    Validating results..                      ok      
    Time used:                                        03:02 = 01:32 + 01:29

daily-test/samples/polymer/forced_3dturbulence: (20/69)
    Compiling..                               ok        01:11
    Starting..                                ok        00:00
    Running..                                 ok        00:14
    Validating results..                      ok      
    Time used:                                        01:26 = 01:11 + 00:14

daily-test/samples/testfield_z: (21/69)
    Compiling..                               ok        01:13
    Starting..                                ok        00:00
    Running..                                 ok        00:24
    Validating results..                      ok      
    Time used:                                        01:38 = 01:13 + 00:24

daily-test/samples/random_uu_particles: (22/69)
    Compiling..                               ok        01:22
    Starting..                                ok        00:00
    Running..                                 ok        01:34
    Validating results..                      not ok: 
Files reference.out, data/time_series.dat differ:
  t: Row 2: 0.062 > 0.056 according to absolute accuracy 0.0015
  dt: Row 1: 0.006227 > 0.0056505 according to absolute accuracy 1.5e-07
  nparpmax: Row 1: 234 < 257 according to absolute accuracy 0.015
  xpm: Row 1: 0.00025157 > 0.00023585 according to absolute accuracy 1.5e-08
  ypm: Row 1: -0.0011749 < -0.0011015 according to absolute accuracy 1.5e-07
  zpm: Row 1: -0.00070431 < -0.00066029 according to absolute accuracy 1.5e-07
  vpxm: Row 2: 3.0926e-05 < 3.1504e-05 according to absolute accuracy 1.5e-09
  vpym: Row 2: 0.00010413 < 0.00010995 according to absolute accuracy 1.5e-08
  vpzm: Row 2: -3.0588e-05 > -3.2275e-05 according to absolute accuracy 1.5e-09
  vpx2m: Row 2: 0.00024155 < 0.00027334 according to absolute accuracy 1.5e-08
  vpy2m: Row 2: 0.00024364 < 0.00027578 according to absolute accuracy 1.5e-08
  vpz2m: Row 2: 0.00024184 < 0.00027331 according to absolute accuracy 1.5e-08
  ruxm: Row 2: 1.4306e-05 > 1.3728e-05 according to absolute accuracy 1.5e-09
  ruym: Row 2: 6.0503e-05 > 5.4678e-05 according to absolute accuracy 1.5e-09
  ruzm: Row 2: -1.6253e-05 < -1.4567e-05 according to absolute accuracy 1.5e-09
  ssm: Row 2: 0.0005884 > 0.00055697 according to absolute accuracy 1.5e-08
  TTmax: Row 2: 1.5062 < 1.5067 according to absolute accuracy 0.00015
  ekin: Row 2: 3.4603e-06 > 3.1144e-06 according to absolute accuracy 1.5e-10
  ekinp: Row 2: 0.00036351 < 0.00041122 according to absolute accuracy 1.5e-07
  ethm: Row 2: 0.90088 > 0.90084 according to absolute accuracy 1.5e-05
  epsK: Row 2: 5.7133e-06 > 5.2194e-06 according to absolute accuracy 1.5e-09
  dedragp: Row 2: 0.0070761 < 0.0080254 according to absolute accuracy 1.5e-06
  ncollpm: Row 1: 1202 < 1246 according to absolute accuracy 0.15
  npartpm: Row 1: 304630 < 333070 according to absolute accuracy 15
Expected:  
 ---it-------t---------dt-------dtdragp-----nparpmax------xpm---------ypm---------zpm---------vpxm--------vpym--------vpzm-------vpx2m-------vpy2m-------vpz2m--------ruxm--------ruym--------ruzm--------ssm---------TTm--------TTmax--------ekin-------ekinp--------ethm--------epsK------dedragp-----ncollpm-----npartpm---  
      0     0.000  6.2270E-03  1.0000E+00  2.3400E+02  2.5157E-04 -1.1749E-03 -7.0431E-04  4.5232E-05  1.6463E-04 -4.6842E-05  8.3289E-04  8.3588E-04  8.3316E-04  0.0000E+00  0.0000E+00  0.0000E+00  0.0000E+00  1.5000E+00  1.5000E+00  0.0000E+00  1.2510E-03  9.0000E-01  0.0000E+00  2.5019E-02  1.2020E+03  3.0463E+05  
     10     0.062  6.2238E-03  1.0000E+00  2.3500E+02  5.3831E-05 -1.3069E-03 -9.0661E-04  3.0926E-05  1.0413E-04 -3.0588E-05  2.4155E-04  2.4364E-04  2.4184E-04  1.4306E-05  6.0503E-05 -1.6253E-05  5.8840E-04  1.5015E+00  1.5062E+00  3.4603E-06  3.6351E-04  9.0088E-01  5.7133E-06  7.0761E-03  1.2700E-02  6.0955E+00  
     20     0.123  5.9173E-03  1.0000E+00  2.3300E+02 -2.4423E-05 -1.2413E-03 -1.0083E-03  2.7659E-05  8.4706E-05 -2.5562E-05  7.4498E-05  7.5209E-05  7.4524E-05  1.7571E-05  7.9921E-05 -2.1278E-05  7.5394E-04  1.5019E+00  1.5081E+00  5.7153E-06  1.1212E-04  9.0113E-01  9.7893E-06  2.1324E-03  7.3800E-03  6.0916E+00  
     30     0.182  5.9179E-03  1.0000E+00  2.3000E+02  1.1718E-04 -1.2765E-03 -8.6971E-04  2.6572E-05  7.8488E-05 -2.3074E-05  2.4472E-05  2.4640E-05  2.4473E-05  1.8659E-05  8.6137E-05 -2.3768E-05  8.0365E-04  1.5020E+00  1.5053E+00  6.2998E-06  3.6792E-05  9.0121E-01  1.0512E-05  6.5261E-04  3.9800E-03  6.0887E+00  
     40     0.241  6.0681E-03  1.0000E+00  2.3200E+02  5.8735E-05 -1.2519E-03 -9.3105E-04  2.5813E-05  7.6941E-05 -2.2381E-05  8.9087E-06  9.0016E-06  8.9391E-06  1.9418E-05  8.7681E-05 -2.4462E-05  8.1911E-04  1.5020E+00  1.5049E+00  6.0072E-06  1.3425E-05  9.0123E-01  9.9017E-06  1.9779E-04  2.3200E-03  6.0909E+00
Got:  
 ---it-------t---------dt-------dtdragp-----nparpmax------xpm---------ypm---------zpm---------vpxm--------vpym--------vpzm-------vpx2m-------vpy2m-------vpz2m--------ruxm--------ruym--------ruzm--------ssm---------TTm--------TTmax--------ekin-------ekinp--------ethm--------epsK------dedragp-----ncollpm-----npartpm---  
      0     0.000  5.6505E-03  1.0000E+00  2.5700E+02  2.3585E-04 -1.1015E-03 -6.6029E-04  4.5232E-05  1.6463E-04 -4.6842E-05  8.3289E-04  8.3588E-04  8.3316E-04  0.0000E+00  0.0000E+00  0.0000E+00  0.0000E+00  1.5000E+00  1.5000E+00  0.0000E+00  1.2510E-03  9.0000E-01  0.0000E+00  2.5019E-02  1.2460E+03  3.3307E+05  
     10     0.056  5.5285E-03  1.0000E+00  2.5700E+02  2.3791E-04 -1.0941E-03 -6.6242E-04  3.1504E-05  1.0995E-04 -3.2275E-05  2.7334E-04  2.7578E-04  2.7331E-04  1.3728E-05  5.4678E-05 -1.4567E-05  5.5697E-04  1.5014E+00  1.5067E+00  3.1144E-06  4.1122E-04  9.0084E-01  5.2194E-06  8.0254E-03  1.3260E-02  6.6611E+00  
     20     0.112  5.6501E-03  1.0000E+00  2.5600E+02  2.3956E-04 -1.0885E-03 -6.6410E-04  2.7556E-05  9.1628E-05 -2.8217E-05  9.0755E-05  9.1778E-05  9.0748E-05  1.7679E-05  7.3001E-05 -1.8624E-05  7.3786E-04  1.5018E+00  1.5081E+00  5.2973E-06  1.3664E-04  9.0111E-01  9.0461E-06  2.6121E-03  7.9400E-03  6.6667E+00  
     30     0.170  5.7750E-03  1.0000E+00  2.5700E+02  2.4106E-04 -1.0834E-03 -6.6565E-04  2.4843E-05  8.5121E-05 -2.6316E-05  3.0590E-05  3.0901E-05  3.0488E-05  2.0397E-05  7.9506E-05 -2.0527E-05  7.9771E-04  1.5020E+00  1.5057E+00  6.1837E-06  4.5989E-05  9.0120E-01  1.0374E-05  8.3381E-04  4.8400E-03  6.6664E+00  
     40     0.227  5.7825E-03  1.0000E+00  2.5700E+02  2.4243E-04 -1.0786E-03 -6.6713E-04  2.2928E-05  8.3896E-05 -2.5057E-05  1.1156E-05  1.1234E-05  1.1120E-05  2.2312E-05  8.0730E-05 -2.1785E-05  8.1705E-04  1.5020E+00  1.5059E+00  5.9620E-06  1.6755E-05  9.0123E-01  9.8750E-06  2.6093E-04  2.6800E-03  6.6695E+00
    Time used:                                        02:56 = 01:22 + 01:34

daily-test/samples/1d-tests/solar-atmosphere-temperature: (23/69)
    Compiling..            [double]           ok        00:51
    Starting..                                ok        00:00
    Running..                                 ok        00:12
    Validating results..                      ok      
    Time used:                                        01:05 = 00:51 + 00:13

daily-test/samples/kin-dynamo: (24/69)
    Compiling..                               not ok:   00:42
Running make '-j' 'FFLAGS_DOUBLE=-fdefault-real-8 -fdefault-double-8' 'CFLAGS_DOUBLE=-DDOUBLE_PRECISION' 'LD_MPI=' 'CFLAGS_FFTW3=' 'FFLAGS_FFTW3=' 'LD_FFTW3=' 'CFLAGS_FFTW2=' 'FFLAGS_FFTW2=' 'LD_FFTW2=' 'FC=mpif90' 'F77=mpif77' 'FFLAGS=-O -O0 -Wall -finit-real=NaN -finit-integer=-2147483648 -g -fbacktrace -fimplicit-none -fcheck=all -ffpe-trap=invalid,zero,overflow' 'LDFLAGS_HELPER=-dynamic' 'FSTD_95=-std=f95' 'FSTD_2003=-std=f2003' 'CC=mpicc' 'CFLAGS=-DFUNDERSC=1' 'default_to_be'
MAKING src/Makefile.inc
precision-check: No such file src/.current-precision -- creating new one at ./src/scripts/precision-check line 36.
touch src/.build-history
echo "@"`hostname` "("`date`")" >> src/.build-history
( cd src && \
	  echo "===== " make FROM_PARENT=src/ -f Makefile.src code "====="; \
	  make FROM_PARENT=src/ -f Makefile.src default_to_be \
	)
=====  make FROM_PARENT=src/ -f Makefile.src code =====
make[1]: Entering directory `/home/pencil/daily-test/samples/kin-dynamo/src'
scripts/mkcparam -b noborder_profiles.f90 nochemistry.f90 nochiral.f90 nocosmicray.f90 nocosmicrayflux.f90 nodensity.f90 deriv_10th.f90 nodetonate.f90 nodustdensity.f90 nodustvelocity.f90 noentropy.f90 noeos.f90 nofixed_point.f90 noforcing.f90 nogravity.f90 nogpu.f90 grid.f90 noheatflux.f90 hydro_kinematic.f90 nohyperresi_strict.f90 nohypervisc_strict.f90 noimplicit_diffusion.f90 noimplicit_physics.f90 noinitial_condition.f90 nointerstellar.f90 nolorenz_gauge.f90 magnetic.f90 magnetic/nomeanfield.f90 magnetic/nomeanfield_demfdt.f90 noneutraldensity.f90 noneutralvelocity.f90 noNSCBC.f90 noopacity.f90 noparticles.f90 noparticles_adaptation.f90 noparticles_coagulation.f90 noparticles_condensation.f90  noparticles_collisions.f90 noparticles_map.f90 noparticles_density.f90  noparticles_mass.f90 noparticles_number.f90 noparticles_radius.f90 noparticles_potential.f90 noparticles_grad.f90 noparticles_selfgravity.f90 noparticles_sink.f90 noparticles_drag.f90 noparticles_spin.f90 noparticles_stalker.f90 noparticles_lyapunov.f90 noparticles_caustics.f90 noparticles_stirring.f90 noparticles_diagnos_dv.f90 noparticles_diagnos_state.f90 noparticles_temperature.f90 noparticles_adsorbed.f90 noparticles_surfspec.f90 noparticles_chemistry.f90 nopointmasses.f90 nopoisson.f90 nopolymer.f90 nopower_spectrum.f90 nopscalar.f90 noradiation.f90 noselfgravity.f90 noshear.f90 noshock.f90 nosignal_handling.f90 nosolid_cells.f90 nospecial.f90 nosupersat.f90 nostreamlines.f90  notestfield.f90 notestflow.f90 notestscalar.f90 noviscosity.f90 cparam.local -o cparam.inc.tmp
${PENCIL_HOME}/utils/pc_identify_revision --reset
make -f Makefile.src  start.o run.o combine_videofiles.o read_videofiles.o read_all_videofiles.o read_vectorfiles.o pre_and_post_processing/pc_collect.o pre_and_post_processing/pc_reduce.o pre_and_post_processing/pc_distribute.o pre_and_post_processing/pc_distribute_z.o pre_and_post_processing/pc_extract.o pre_and_post_processing/pc_configtest.o pre_and_post_processing/pc_tecplot.o pre_and_post_processing/pc_tecplot_solid.o start.x run.x combine_videofiles.x read_videofiles.x read_all_videofiles.x read_vectorfiles.x pre_and_post_processing/pc_collect.x pre_and_post_processing/pc_reduce.x pre_and_post_processing/pc_distribute.x pre_and_post_processing/pc_distribute_z.x pre_and_post_processing/pc_extract.x pre_and_post_processing/pc_configtest.x pre_and_post_processing/pc_tecplot.x pre_and_post_processing/pc_tecplot_solid.x
make[2]: Entering directory `/home/pencil/daily-test/samples/kin-dynamo/src'
mpif90 -O -O0 -Wall -finit-real=NaN -finit-integer=-2147483648 -g -fbacktrace -fimplicit-none -fcheck=all -ffpe-trap=invalid,zero,overflow    -std=f95 -o cparam.o -c cparam.f90
mpicc -DFUNDERSC=1    -o syscalls_ansi.o -c syscalls_ansi.c
scripts/mkdummyinc -d file_io_common.f90 -s file_io_f95.f90 -o file_io_common.inc
scripts/mkdummyinc -d noinitial_condition.f90 -s noinitial_condition.f90 -o initial_condition_dummies.inc
mpicc -DFUNDERSC=1    -o nogsl.o -c nogsl.c
cparam_pencils.inc:427:
    Included at cparam.f90:23:

   , 'hjparallel    ', 'hjperp        ', 'nu_ni1        ', 'gamma_A2      '  &
1
Warning: Limit of 39 continuations exceeded in statement at (1)
mpif90 -O -O0 -Wall -finit-real=NaN -finit-integer=-2147483648 -g -fbacktrace -fimplicit-none -fcheck=all -ffpe-trap=invalid,zero,overflow    -std=f95 -o cdata.o -c cdata.f90
mpif90 -O -O0 -Wall -finit-real=NaN -finit-integer=-2147483648 -g -fbacktrace -fimplicit-none -fcheck=all -ffpe-trap=invalid,zero,overflow    -std=f95 -o general.o -c general.f90
mpif90 -O -O0 -Wall -finit-real=NaN -finit-integer=-2147483648 -g -fbacktrace -fimplicit-none -fcheck=all -ffpe-trap=invalid,zero,overflow    -std=f95 -o noweno_transport.o -c noweno_transport.f90
noweno_transport.f90:16.74:

    subroutine weno_transp(fq,m,n,iq,iq1,iux,iuy,iuz,dq,dx_1,dy_1,dz_1,ref,ref1)
                                                                          1
Warning: Unused dummy argument 'ref' at (1)
noweno_transport.f90:16.79:

subroutine weno_transp(fq,m,n,iq,iq1,iux,iuy,iuz,dq,dx_1,dy_1,dz_1,ref,ref1)
                                                                           1
Warning: Unused dummy argument 'ref1' at (1)
general.f90:2325.41:

      DATA Q1,Q2,Q3,Q4,Q5 /.04687499995D0,-.2002690873D-3,   &
                                         1
Warning: Change of value in conversion from  REAL(8) to REAL(4) at (1)
general.f90:2325.57:

      DATA Q1,Q2,Q3,Q4,Q5 /.04687499995D0,-.2002690873D-3,   &
                                                         1
Warning: Change of value in conversion from  REAL(8) to REAL(4) at (1)
general.f90:2326.20:

      .8449199096D-5,-.88228987D-6,.105787412D-6 /
                    1
Warning: Change of value in conversion from  REAL(8) to REAL(4) at (1)
general.f90:2326.34:

      .8449199096D-5,-.88228987D-6,.105787412D-6 /
                                  1
Warning: Change of value in conversion from  REAL(8) to REAL(4) at (1)
general.f90:2326.48:

      .8449199096D-5,-.88228987D-6,.105787412D-6 /
                                                1
Warning: Change of value in conversion from  REAL(8) to REAL(4) at (1)
general.f90:2324.54:

      .2457520174D-5,-.240337019D-6 /,P6 /.636619772D0 /
                                                      1
Warning: Change of value in conversion from  REAL(8) to REAL(4) at (1)
general.f90:2323.42:

      DATA P1,P2,P3,P4,P5 /1.D0,.183105D-2,-.3516396496D-4,  &
                                          1
Warning: Change of value in conversion from  REAL(8) to REAL(4) at (1)
general.f90:2323.58:

      DATA P1,P2,P3,P4,P5 /1.D0,.183105D-2,-.3516396496D-4,  &
                                                          1
Warning: Change of value in conversion from  REAL(8) to REAL(4) at (1)
general.f90:2324.20:

      .2457520174D-5,-.240337019D-6 /,P6 /.636619772D0 /
                    1
Warning: Change of value in conversion from  REAL(8) to REAL(4) at (1)
general.f90:2324.35:

      .2457520174D-5,-.240337019D-6 /,P6 /.636619772D0 /
                                   1
Warning: Change of value in conversion from  REAL(8) to REAL(4) at (1)
general.f90:2286.42:

      DATA Q1,Q2,Q3,Q4,Q5 /-.1562499995D-1,.1430488765D-3, &
                                          1
Warning: Change of value in conversion from  REAL(8) to REAL(4) at (1)
general.f90:2286.57:

      DATA Q1,Q2,Q3,Q4,Q5 /-.1562499995D-1,.1430488765D-3, &
                                                         1
Warning: Change of value in conversion from  REAL(8) to REAL(4) at (1)
general.f90:2287.21:

      -.6911147651D-5,.7621095161D-6,-.9349451520D-7 /
                     1
Warning: Change of value in conversion from  REAL(8) to REAL(4) at (1)
general.f90:2287.36:

      -.6911147651D-5,.7621095161D-6,-.9349451520D-7 /
                                    1
Warning: Change of value in conversion from  REAL(8) to REAL(4) at (1)
general.f90:2287.52:

      -.6911147651D-5,.7621095161D-6,-.9349451520D-7 /
                                                    1
Warning: Change of value in conversion from  REAL(8) to REAL(4) at (1)
general.f90:2284.47:

      DATA P1,P2,P3,P4,P5 /1.D0,-.1098628627D-2,.2734510407D-4, &
                                               1
Warning: Change of value in conversion from  REAL(8) to REAL(4) at (1)
general.f90:2284.62:

      DATA P1,P2,P3,P4,P5 /1.D0,-.1098628627D-2,.2734510407D-4, &
                                                              1
Warning: Change of value in conversion from  REAL(8) to REAL(4) at (1)
general.f90:2285.21:

      -.2073370639D-5,.2093887211D-6 /
                     1
Warning: Change of value in conversion from  REAL(8) to REAL(4) at (1)
general.f90:2285.36:

      -.2073370639D-5,.2093887211D-6 /
                                    1
Warning: Change of value in conversion from  REAL(8) to REAL(4) at (1)
general.f90:4340.34:

    entry yy_transform_strip_other(th,ph,thphprime)
                                  1
Warning: Unused variable 'yy_transform_strip_other' declared at (1)
general.f90:4326.10:

      use Cdata, only: y,z,costh,sinth,cosph,sinph
          1
Warning: Unused module variable 'y' which has been explicitly imported at (1)
general.f90:4326.10:

      use Cdata, only: y,z,costh,sinth,cosph,sinph
          1
Warning: Unused module variable 'z' which has been explicitly imported at (1)
general.f90:3399.33:

  entry  write_by_ranges_1d_cmplx(unit,buffer_cmplx,ranges)
                                 1
Warning: Unused variable 'write_by_ranges_1d_cmplx' declared at (1)
general.f90:3336.32:

  entry write_by_ranges_2d_cmplx( unit, buffer_cmplx, xranges, yranges, trans )
                                1
Warning: Unused variable 'write_by_ranges_2d_cmplx' declared at (1)
general.f90:2714.32:

  entry write_full_columns_cmplx(unit,buffer_cmplx,range,unfilled,ncol,fmt)
                                1
Warning: Unused variable 'write_full_columns_cmplx' declared at (1)
general.f90:2425.25:

      real, save :: dxdy1, dx1, dy1
                         1
Warning: Unused variable 'dxdy1' declared at (1)
general.f90:2426.18:

      integer :: i, ix0, iy0
                  1
Warning: Unused variable 'i' declared at (1)
general.f90:4807:0: warning: ‘newton_arr’ defined but not used [-Wunused-function]
     subroutine newton_arr(x,func,add,fmax,dxmax,itmax)
 ^
general.f90:1437:0: warning: ‘tridag_double’ defined but not used [-Wunused-function]
     subroutine tridag_double(a,b,c,r,u,err)
 ^
general.f90:957:0: warning: ‘chk_time’ defined but not used [-Wunused-function]
     subroutine chk_time(label,time1,time2)
 ^
mpif90 -O -O0 -Wall -finit-real=NaN -finit-integer=-2147483648 -g -fbacktrace -fimplicit-none -fcheck=all -ffpe-trap=invalid,zero,overflow    -std=f95 -o syscalls.o -c syscalls.f90
mpif90 -O -O0 -Wall -finit-real=NaN -finit-integer=-2147483648 -g -fbacktrace -fimplicit-none -fcheck=all -ffpe-trap=invalid,zero,overflow    -std=f95 -o noyinyang.o -c noyinyang.f90
mpif90 -O -O0 -Wall -finit-real=NaN -finit-integer=-2147483648 -g -fbacktrace -fimplicit-none -fcheck=all -ffpe-trap=invalid,zero,overflow    -std=f95 -o nogpu.o -c nogpu.f90
noyinyang.f90:86.42:

    subroutine coeffs_to_weights(intcoeffs,indweights)
                                          1
Warning: Unused dummy argument 'intcoeffs' at (1)
noyinyang.f90:62.50:

    function prep_interp(thphprime,indcoeffs,itype,th_range) result (nok)
                                                  1
Warning: Unused dummy argument 'itype' at (1)
noyinyang.f90:62.34:

    function prep_interp(thphprime,indcoeffs,itype,th_range) result (nok)
                                  1
Warning: Unused dummy argument 'thphprime' at (1)
noyinyang.f90:43.51:

    subroutine biquad_interp(indcoeffs, ith, iph, f, buffer, i2buf, i3buf)
                                                   1
Warning: Unused dummy argument 'f' at (1)
noyinyang.f90:43.66:

    subroutine biquad_interp(indcoeffs, ith, iph, f, buffer, i2buf, i3buf)
                                                                  1
Warning: Unused dummy argument 'i2buf' at (1)
noyinyang.f90:43.73:

    subroutine biquad_interp(indcoeffs, ith, iph, f, buffer, i2buf, i3buf)
                                                                         1
Warning: Unused dummy argument 'i3buf' at (1)
noyinyang.f90:43.38:

    subroutine biquad_interp(indcoeffs, ith, iph, f, buffer, i2buf, i3buf)
                                      1
Warning: Unused dummy argument 'indcoeffs' at (1)
noyinyang.f90:43.48:

    subroutine biquad_interp(indcoeffs, ith, iph, f, buffer, i2buf, i3buf)
                                                1
Warning: Unused dummy argument 'iph' at (1)
noyinyang.f90:43.43:

    subroutine biquad_interp(indcoeffs, ith, iph, f, buffer, i2buf, i3buf)
                                           1
Warning: Unused dummy argument 'ith' at (1)
noyinyang.f90:24.50:

    subroutine bilin_interp(indcoeffs, ith, iph, f, buffer, i2buf, i3buf)
                                                  1
Warning: Unused dummy argument 'f' at (1)
noyinyang.f90:24.65:

    subroutine bilin_interp(indcoeffs, ith, iph, f, buffer, i2buf, i3buf)
                                                                 1
Warning: Unused dummy argument 'i2buf' at (1)
noyinyang.f90:24.72:

    subroutine bilin_interp(indcoeffs, ith, iph, f, buffer, i2buf, i3buf)
                                                                        1
Warning: Unused dummy argument 'i3buf' at (1)
noyinyang.f90:24.37:

    subroutine bilin_interp(indcoeffs, ith, iph, f, buffer, i2buf, i3buf)
                                     1
Warning: Unused dummy argument 'indcoeffs' at (1)
noyinyang.f90:24.47:

    subroutine bilin_interp(indcoeffs, ith, iph, f, buffer, i2buf, i3buf)
                                               1
Warning: Unused dummy argument 'iph' at (1)
noyinyang.f90:24.42:

    subroutine bilin_interp(indcoeffs, ith, iph, f, buffer, i2buf, i3buf)
                                          1
Warning: Unused dummy argument 'ith' at (1)
mpif90 -O -O0 -Wall -finit-real=NaN -finit-integer=-2147483648 -g -fbacktrace -fimplicit-none -fcheck=all -ffpe-trap=invalid,zero,overflow     -o nompicomm.o -c nompicomm.f90
nompicomm.f90:470.13:

             c1*cshift(f(l2i:l2,m1:m2,:,ivar1:ivar2),-displs+2,2) &
             1
Warning: Possible change of value in conversion from REAL(8) to REAL(4) at (1)
nompicomm.f90:477.13:

             c1*cshift(f(l1:l1i,m1:m2,:,ivar1:ivar2), displs-2,2) &
             1
Warning: Possible change of value in conversion from REAL(8) to REAL(4) at (1)
nompicomm.f90:2833.35:

      entry mpigather_and_out_cmplx( sendbuf_cmplx, unit, ltransp, kxrange, kyr
                                   1
Warning: Unused variable 'mpigather_and_out_cmplx' declared at (1)
nompicomm.f90:1526.61:

    subroutine mpireduce_and_arr(fland_tmp,fland,nreduce,comm)
                                                             1
Warning: Unused dummy argument 'comm' at (1)
nompicomm.f90:1517.53:

    subroutine mpireduce_and_scl(fland_tmp,fland,comm)
                                                     1
Warning: Unused dummy argument 'comm' at (1)
nompicomm.f90:1507.58:

    subroutine mpireduce_or_arr(flor_tmp,flor,nreduce,comm)
                                                          1
Warning: Unused dummy argument 'comm' at (1)
nompicomm.f90:1498.50:

    subroutine mpireduce_or_scl(flor_tmp,flor,comm)
                                                  1
Warning: Unused dummy argument 'comm' at (1)
nompicomm.f90:1399.56:

    subroutine mpireduce_sum_scl(fsum_tmp,fsum,idir,comm)
                                                        1
Warning: Unused dummy argument 'comm' at (1)
nompicomm.f90:1369.64:

    subroutine mpireduce_sum_int_arr2(fsum_tmp,fsum,nreduce,comm)
                                                                1
Warning: Unused dummy argument 'comm' at (1)
nompicomm.f90:1359.63:

    subroutine mpireduce_sum_int_arr(fsum_tmp,fsum,nreduce,comm)
                                                               1
Warning: Unused dummy argument 'comm' at (1)
nompicomm.f90:1350.55:

    subroutine mpireduce_sum_int_scl(fsum_tmp,fsum,comm)
                                                       1
Warning: Unused dummy argument 'comm' at (1)
nompicomm.f90:1340.59:

    subroutine mpireduce_min_arr(fmin_tmp,fmin,nreduce,comm)
                                                           1
Warning: Unused dummy argument 'comm' at (1)
nompicomm.f90:1331.51:

    subroutine mpireduce_min_scl(fmin_tmp,fmin,comm)
                                                   1
Warning: Unused dummy argument 'comm' at (1)
nompicomm.f90:1321.59:

    subroutine mpireduce_max_arr(fmax_tmp,fmax,nreduce,comm)
                                                           1
Warning: Unused dummy argument 'comm' at (1)
nompicomm.f90:1312.51:

    subroutine mpireduce_max_scl(fmax_tmp,fmax,comm)
                                                   1
Warning: Unused dummy argument 'comm' at (1)
nompicomm.f90:1303.55:

    subroutine mpireduce_max_scl_int(fmax_tmp,fmax,comm)
                                                       1
Warning: Unused dummy argument 'comm' at (1)
nompicomm.f90:1293.55:

    subroutine mpiallreduce_or_scl(flor_tmp, flor, comm)
                                                       1
Warning: Unused dummy argument 'comm' at (1)
nompicomm.f90:1284.58:

    subroutine mpiallreduce_min_scl_sgl(fmin_tmp,fmin,comm)
                                                          1
Warning: Unused dummy argument 'comm' at (1)
nompicomm.f90:1275.58:

    subroutine mpiallreduce_min_scl_dbl(fmin_tmp,fmin,comm)
                                                          1
Warning: Unused dummy argument 'comm' at (1)
nompicomm.f90:1265.62:

    subroutine mpiallreduce_max_arr(fmax_tmp,fmax,nreduce,comm)
                                                              1
Warning: Unused dummy argument 'comm' at (1)
nompicomm.f90:1256.58:

    subroutine mpiallreduce_max_scl_dbl(fmax_tmp,fmax,comm)
                                                          1
Warning: Unused dummy argument 'comm' at (1)
nompicomm.f90:1247.58:

    subroutine mpiallreduce_max_scl_sgl(fmax_tmp,fmax,comm)
                                                          1
Warning: Unused dummy argument 'comm' at (1)
nompicomm.f90:1237.71:

    subroutine mpiallreduce_sum_int_arr(fsum_tmp,fsum,nreduce,idir,comm)
                                                                       1
Warning: Unused dummy argument 'comm' at (1)
nompicomm.f90:1237.66:

    subroutine mpiallreduce_sum_int_arr(fsum_tmp,fsum,nreduce,idir,comm)
                                                                  1
Warning: Unused dummy argument 'idir' at (1)
nompicomm.f90:1228.58:

    subroutine mpiallreduce_sum_int_scl(fsum_tmp,fsum,comm)
                                                          1
Warning: Unused dummy argument 'comm' at (1)
nompicomm.f90:1121.68:

    subroutine mpibcast_char_arr(cbcast_array,nbcast_array,proc,comm)
                                                                    1
Warning: Unused dummy argument 'comm' at (1)
nompicomm.f90:1112.55:

    subroutine mpibcast_char_scl(cbcast_array,proc,comm)
                                                       1
Warning: Unused dummy argument 'comm' at (1)
nompicomm.f90:1093.56:

    subroutine mpibcast_double_scl(bcast_array,proc,comm)
                                                        1
Warning: Unused dummy argument 'comm' at (1)
nompicomm.f90:1044.54:

    subroutine mpibcast_real_scl(bcast_array,proc,comm)
                                                      1
Warning: Unused dummy argument 'comm' at (1)
nompicomm.f90:1018.67:

    subroutine mpibcast_int_arr(ibcast_array,nbcast_array,proc,comm)
                                                                   1
Warning: Unused dummy argument 'comm' at (1)
nompicomm.f90:1009.54:

    subroutine mpibcast_int_scl(ibcast_array,proc,comm)
                                                      1
Warning: Unused dummy argument 'comm' at (1)
nompicomm.f90:999.71:

    subroutine mpibcast_logical_arr2(bcast_array,nbcast_array,proc,comm)
                                                                       1
Warning: Unused dummy argument 'comm' at (1)
nompicomm.f90:989.71:

    subroutine mpibcast_logical_arr(lbcast_array,nbcast_array,proc,comm)
                                                                       1
Warning: Unused dummy argument 'comm' at (1)
nompicomm.f90:980.58:

    subroutine mpibcast_logical_scl(lbcast_array,proc,comm)
                                                          1
Warning: Unused dummy argument 'comm' at (1)
nompicomm.f90:932.69:

    subroutine mpisendrecv_real_arr4(send_array,sendcnt_arr,proc_dest,sendtag, &
                                                                     1
Warning: Unused dummy argument 'proc_dest' at (1)
nompicomm.f90:933.24:

     recv_array,proc_src,recvtag)
                        1
Warning: Unused dummy argument 'proc_src' at (1)
nompicomm.f90:933.15:

     recv_array,proc_src,recvtag)
               1
Warning: Unused dummy argument 'recv_array' at (1)
nompicomm.f90:932.47:

    subroutine mpisendrecv_real_arr4(send_array,sendcnt_arr,proc_dest,sendtag, &
                                               1
Warning: Unused dummy argument 'send_array' at (1)
nompicomm.f90:920.69:

    subroutine mpisendrecv_real_arr3(send_array,sendcnt_arr,proc_dest,sendtag, &
                                                                     1
Warning: Unused dummy argument 'proc_dest' at (1)
nompicomm.f90:921.24:

     recv_array,proc_src,recvtag)
                        1
Warning: Unused dummy argument 'proc_src' at (1)
nompicomm.f90:921.15:

     recv_array,proc_src,recvtag)
               1
Warning: Unused dummy argument 'recv_array' at (1)
nompicomm.f90:920.47:

    subroutine mpisendrecv_real_arr3(send_array,sendcnt_arr,proc_dest,sendtag, &
                                               1
Warning: Unused dummy argument 'send_array' at (1)
nompicomm.f90:908.69:

    subroutine mpisendrecv_real_arr2(send_array,sendcnt_arr,proc_dest,sendtag, &
                                                                     1
Warning: Unused dummy argument 'proc_dest' at (1)
nompicomm.f90:909.24:

     recv_array,proc_src,recvtag)
                        1
Warning: Unused dummy argument 'proc_src' at (1)
nompicomm.f90:909.15:

     recv_array,proc_src,recvtag)
               1
Warning: Unused dummy argument 'recv_array' at (1)
nompicomm.f90:908.47:

    subroutine mpisendrecv_real_arr2(send_array,sendcnt_arr,proc_dest,sendtag, &
                                               1
Warning: Unused dummy argument 'send_array' at (1)
nompicomm.f90:896.64:

    subroutine mpisendrecv_real_arr(send_array,sendcnt,proc_dest,sendtag, &
                                                                1
Warning: Unused dummy argument 'proc_dest' at (1)
nompicomm.f90:897.25:

      recv_array,proc_src,recvtag)
                         1
Warning: Unused dummy argument 'proc_src' at (1)
nompicomm.f90:897.16:

      recv_array,proc_src,recvtag)
                1
Warning: Unused dummy argument 'recv_array' at (1)
nompicomm.f90:896.46:

    subroutine mpisendrecv_real_arr(send_array,sendcnt,proc_dest,sendtag, &
                                              1
Warning: Unused dummy argument 'send_array' at (1)
nompicomm.f90:886.56:

    subroutine mpisendrecv_real_scl(send_array,proc_dest,sendtag, &
                                                        1
Warning: Unused dummy argument 'proc_dest' at (1)
nompicomm.f90:887.25:

      recv_array,proc_src,recvtag)
                         1
Warning: Unused dummy argument 'proc_src' at (1)
nompicomm.f90:887.16:

      recv_array,proc_src,recvtag)
                1
Warning: Unused dummy argument 'recv_array' at (1)
nompicomm.f90:886.46:

    subroutine mpisendrecv_real_scl(send_array,proc_dest,sendtag, &
                                              1
Warning: Unused dummy argument 'send_array' at (1)
nompicomm.f90:659.76:

   subroutine mpirecv_int_arr(bcast_array,nbcast_array,proc_src,tag_id,comm,non
                                                                           1
Warning: Unused dummy argument 'comm' at (1)
nompicomm.f90:659.85:

tine mpirecv_int_arr(bcast_array,nbcast_array,proc_src,tag_id,comm,nonblock)
                                                                           1
Warning: Unused dummy argument 'nonblock' at (1)
nompicomm.f90:1489:0: warning: ‘mpireduce_sum_double_arr4’ defined but not used [-Wunused-function]
     subroutine mpireduce_sum_double_arr4(dsum_tmp,dsum,nreduce)
 ^
nompicomm.f90:1480:0: warning: ‘mpireduce_sum_double_arr3’ defined but not used [-Wunused-function]
     subroutine mpireduce_sum_double_arr3(dsum_tmp,dsum,nreduce)
 ^
nompicomm.f90:1471:0: warning: ‘mpireduce_sum_double_arr2’ defined but not used [-Wunused-function]
     subroutine mpireduce_sum_double_arr2(dsum_tmp,dsum,nreduce)
 ^
nompicomm.f90:1462:0: warning: ‘mpireduce_sum_double_arr’ defined but not used [-Wunused-function]
     subroutine mpireduce_sum_double_arr(dsum_tmp,dsum,nreduce)
 ^
nompicomm.f90:1454:0: warning: ‘mpireduce_sum_double_scl’ defined but not used [-Wunused-function]
     subroutine mpireduce_sum_double_scl(dsum_tmp,dsum)
 ^
mpif90 -O -O0 -Wall -finit-real=NaN -finit-integer=-2147483648 -g -fbacktrace -fimplicit-none -fcheck=all -ffpe-trap=invalid,zero,overflow    -std=f95 -o messages.o -c messages.f90
mpif90 -O -O0 -Wall -finit-real=NaN -finit-integer=-2147483648 -g -fbacktrace -fimplicit-none -fcheck=all -ffpe-trap=invalid,zero,overflow    -std=f95 -o ghost_check.o -c ghost_check.f90
mpif90 -O -O0 -Wall -finit-real=NaN -finit-integer=-2147483648 -g -fbacktrace -fimplicit-none -fcheck=all -ffpe-trap=invalid,zero,overflow    -std=f95 -o nosolid_cells_mpicomm.o -c nosolid_cells_mpicomm.f90
mpif90 -O -O0 -Wall -finit-real=NaN -finit-integer=-2147483648 -g -fbacktrace -fimplicit-none -fcheck=all -ffpe-trap=invalid,zero,overflow    -std=f95 -o combine_videofiles.o -c combine_videofiles.f90
mpif90 -O -O0 -Wall -finit-real=NaN -finit-integer=-2147483648 -g -fbacktrace -fimplicit-none -fcheck=all -ffpe-trap=invalid,zero,overflow    -std=f95 -o read_videofiles.o -c read_videofiles.f90
mpif90 -O -O0 -Wall -finit-real=NaN -finit-integer=-2147483648 -g -fbacktrace -fimplicit-none -fcheck=all -ffpe-trap=invalid,zero,overflow    -std=f95 -o read_all_videofiles.o -c read_all_videofiles.f90
mpif90 -O -O0 -Wall -finit-real=NaN -finit-integer=-2147483648 -g -fbacktrace -fimplicit-none -fcheck=all -ffpe-trap=invalid,zero,overflow    -std=f95 -o read_vectorfiles.o -c read_vectorfiles.f90
nosolid_cells_mpicomm.f90:33:0: warning: ‘isendrcv_bdry_x_ogrid’ defined but not used [-Wunused-function]
     subroutine isendrcv_bdry_x_ogrid(f)
 ^
mpif90 read_vectorfiles.o cparam.o cdata.o general.o syscalls.o syscalls_ansi.o nompicomm.o  -o read_vectorfiles.x -dynamic
messages.f90:531:0: warning: ‘terminal_setfgbrightcolor’ defined but not used [-Wunused-function]
     subroutine terminal_setfgbrightcolor(col)
 ^
messages.f90:517:0: warning: ‘terminal_setfgcolor’ defined but not used [-Wunused-function]
     subroutine terminal_setfgcolor(col)
 ^
mpif90 combine_videofiles.o cparam.o cdata.o general.o syscalls.o syscalls_ansi.o nompicomm.o  -o combine_videofiles.x -dynamic
mpif90 -O -O0 -Wall -finit-real=NaN -finit-integer=-2147483648 -g -fbacktrace -fimplicit-none -fcheck=all -ffpe-trap=invalid,zero,overflow    -std=f95 -o deriv_10th.o -c deriv_10th.f90
mpif90 -O -O0 -Wall -finit-real=NaN -finit-integer=-2147483648 -g -fbacktrace -fimplicit-none -fcheck=all -ffpe-trap=invalid,zero,overflow    -std=f95 -o farray.o -c farray.f90
mpif90 -O -O0 -Wall -finit-real=NaN -finit-integer=-2147483648 -g -fbacktrace -fimplicit-none -fcheck=all -ffpe-trap=invalid,zero,overflow    -o file_io_f95.o -c file_io_f95.f90
mpif90 -O -O0 -Wall -finit-real=NaN -finit-integer=-2147483648 -g -fbacktrace -fimplicit-none -fcheck=all -ffpe-trap=invalid,zero,overflow    -std=f95 -o noyinyang_mpi.o -c noyinyang_mpi.f90
mpif90 -O -O0 -Wall -finit-real=NaN -finit-integer=-2147483648 -g -fbacktrace -fimplicit-none -fcheck=all -ffpe-trap=invalid,zero,overflow    -std=f95 -o shared_variables.o -c shared_variables.f90
mpif90 -O -O0 -Wall -finit-real=NaN -finit-integer=-2147483648 -g -fbacktrace -fimplicit-none -fcheck=all -ffpe-trap=invalid,zero,overflow    -std=f95 -o nohdf5_io.o -c nohdf5_io.f90
mpif90 -O -O0 -Wall -finit-real=NaN -finit-integer=-2147483648 -g -fbacktrace -fimplicit-none -fcheck=all -ffpe-trap=invalid,zero,overflow    -std=f95 -o debug_io_dist.o -c debug_io_dist.f90
mpif90 -O -O0 -Wall -finit-real=NaN -finit-integer=-2147483648 -g -fbacktrace -fimplicit-none -fcheck=all -ffpe-trap=invalid,zero,overflow    -std=f95 -o noimplicit_diffusion.o -c noimplicit_diffusion.f90
mpif90 read_videofiles.o cparam.o cdata.o general.o syscalls.o syscalls_ansi.o nompicomm.o  -o read_videofiles.x -dynamic
farray.f90:400.21:

      do i=1,mscratch
                     1
Warning: DO loop at (1) will be executed zero times
noyinyang_mpi.f90:40.38:

    subroutine zsum_yy(fnamexy,iname,m,n,a)
                                      1
Warning: Unused dummy argument 'm' at (1)
noyinyang_mpi.f90:40.40:

    subroutine zsum_yy(fnamexy,iname,m,n,a)
                                        1
Warning: Unused dummy argument 'n' at (1)
shared_variables.f90:266:0: warning: ‘get_variable_real0d_alt’ defined but not used [-Wunused-function]
     subroutine get_variable_real0d_alt(varname,variable,ierr)
 ^
nohdf5_io.f90:160.40:

    subroutine output_hdf5_4D(name, data, nv)
                                        1
Warning: Unused dummy argument 'data' at (1)
nohdf5_io.f90:160.34:

    subroutine output_hdf5_4D(name, data, nv)
                                  1
Warning: Unused dummy argument 'name' at (1)
nohdf5_io.f90:151.40:

    subroutine output_hdf5_3D(name, data)
                                        1
Warning: Unused dummy argument 'data' at (1)
nohdf5_io.f90:151.34:

    subroutine output_hdf5_3D(name, data)
                                  1
Warning: Unused dummy argument 'name' at (1)
nohdf5_io.f90:141.40:

    subroutine output_hdf5_1D(name, data, nv)
                                        1
Warning: Unused dummy argument 'data' at (1)
nohdf5_io.f90:141.34:

    subroutine output_hdf5_1D(name, data, nv)
                                  1
Warning: Unused dummy argument 'name' at (1)
nohdf5_io.f90:132.40:

    subroutine output_hdf5_0D(name, data)
                                        1
Warning: Unused dummy argument 'data' at (1)
nohdf5_io.f90:132.34:

    subroutine output_hdf5_0D(name, data)
                                  1
Warning: Unused dummy argument 'name' at (1)
nohdf5_io.f90:123.41:

    subroutine output_hdf5_int(name, data)
                                         1
Warning: Unused dummy argument 'data' at (1)
nohdf5_io.f90:123.35:

    subroutine output_hdf5_int(name, data)
                                   1
Warning: Unused dummy argument 'name' at (1)
nohdf5_io.f90:114.44:

    subroutine output_hdf5_string(name, data)
                                            1
Warning: Unused dummy argument 'data' at (1)
nohdf5_io.f90:114.38:

    subroutine output_hdf5_string(name, data)
                                      1
Warning: Unused dummy argument 'name' at (1)
nohdf5_io.f90:103.33:

    subroutine input_hdf5_4D(name, data, nv)
                                 1
Warning: Unused dummy argument 'name' at (1)
nohdf5_io.f90:93.33:

    subroutine input_hdf5_3D(name, data)
                                 1
Warning: Unused dummy argument 'name' at (1)
nohdf5_io.f90:82.33:

    subroutine input_hdf5_1D(name, data, nv)
                                 1
Warning: Unused dummy argument 'name' at (1)
nohdf5_io.f90:72.33:

    subroutine input_hdf5_0D(name, data)
                                 1
Warning: Unused dummy argument 'name' at (1)
nohdf5_io.f90:64.37:

    subroutine create_group_hdf5(name)
                                     1
Warning: Unused dummy argument 'name' at (1)
nohdf5_io.f90:47.34:

    subroutine file_open_hdf5(file, truncate, global, read_only)
                                  1
Warning: Unused dummy argument 'file' at (1)
nohdf5_io.f90:47.52:

    subroutine file_open_hdf5(file, truncate, global, read_only)
                                                    1
Warning: Unused dummy argument 'global' at (1)
nohdf5_io.f90:47.63:

    subroutine file_open_hdf5(file, truncate, global, read_only)
                                                               1
Warning: Unused dummy argument 'read_only' at (1)
nohdf5_io.f90:47.44:

    subroutine file_open_hdf5(file, truncate, global, read_only)
                                            1
Warning: Unused dummy argument 'truncate' at (1)
mpif90 read_all_videofiles.o cparam.o cdata.o general.o syscalls.o syscalls_ansi.o nompicomm.o  -o read_all_videofiles.x -dynamic
debug_io_dist.f90:228.13:

      t_sp = t
             1
Warning: Possible change of value in conversion from REAL(8) to REAL(4) at (1)
debug_io_dist.f90:200.13:

      t_sp = t
             1
Warning: Possible change of value in conversion from REAL(8) to REAL(4) at (1)
debug_io_dist.f90:149.13:

      t_sp = t
             1
Warning: Possible change of value in conversion from REAL(8) to REAL(4) at (1)
debug_io_dist.f90:94.13:

      t_sp = t
             1
Warning: Possible change of value in conversion from REAL(8) to REAL(4) at (1)
noimplicit_diffusion.f90:41.51:

    subroutine integrate_diffusion(get_diffus_coeff, f, ivar1, ivar2)
                                                   1
Warning: Unused dummy argument 'get_diffus_coeff' at (1)
deriv_10th.f90:2442.57:

    subroutine bval_from_3rd_arr(f,topbot,j,idir,val,func)
                                                         1
Warning: Unused dummy argument 'func' at (1)
deriv_10th.f90:2025.40:

    logical function heatflux_deriv_x( f, inh, fac, topbot )
                                        1
Warning: Unused dummy argument 'f' at (1)
deriv_10th.f90:2025.50:

    logical function heatflux_deriv_x( f, inh, fac, topbot )
                                                  1
Warning: Unused dummy argument 'fac' at (1)
deriv_10th.f90:2025.45:

    logical function heatflux_deriv_x( f, inh, fac, topbot )
                                             1
Warning: Unused dummy argument 'inh' at (1)
deriv_10th.f90:2025.58:

    logical function heatflux_deriv_x( f, inh, fac, topbot )
                                                          1
Warning: Unused dummy argument 'topbot' at (1)
deriv_10th.f90:1706.26:

    subroutine der4i1j1k(f,ik,df,i,j,k)
                          1
Warning: Unused dummy argument 'f' at (1)
deriv_10th.f90:1710.33:

      real, dimension (nx) :: fac
                                 1
Warning: Unused variable 'fac' declared at (1)
deriv_10th.f90:1706.34:

    subroutine der4i1j1k(f,ik,df,i,j,k)
                                  1
Warning: Unused dummy argument 'i' at (1)
deriv_10th.f90:1706.29:

    subroutine der4i1j1k(f,ik,df,i,j,k)
                             1
Warning: Unused dummy argument 'ik' at (1)
deriv_10th.f90:1706.36:

    subroutine der4i1j1k(f,ik,df,i,j,k)
                                    1
Warning: Unused dummy argument 'j' at (1)
deriv_10th.f90:1706.38:

    subroutine der4i1j1k(f,ik,df,i,j,k)
                                      1
Warning: Unused dummy argument 'k' at (1)
deriv_10th.f90:1694.26:

    subroutine der3i2j1k(f,ik,df,i,j,k)
                          1
Warning: Unused dummy argument 'f' at (1)
deriv_10th.f90:1698.33:

      real, dimension (nx) :: fac
                                 1
Warning: Unused variable 'fac' declared at (1)
deriv_10th.f90:1694.34:

    subroutine der3i2j1k(f,ik,df,i,j,k)
                                  1
Warning: Unused dummy argument 'i' at (1)
deriv_10th.f90:1694.29:

    subroutine der3i2j1k(f,ik,df,i,j,k)
                             1
Warning: Unused dummy argument 'ik' at (1)
deriv_10th.f90:1694.36:

    subroutine der3i2j1k(f,ik,df,i,j,k)
                                    1
Warning: Unused dummy argument 'j' at (1)
deriv_10th.f90:1694.38:

    subroutine der3i2j1k(f,ik,df,i,j,k)
                                      1
Warning: Unused dummy argument 'k' at (1)
deriv_10th.f90:1682.24:

    subroutine der3i3j(f,k,df,i,j)
                        1
Warning: Unused dummy argument 'f' at (1)
deriv_10th.f90:1686.33:

      real, dimension (nx) :: fac
                                 1
Warning: Unused variable 'fac' declared at (1)
deriv_10th.f90:1682.31:

    subroutine der3i3j(f,k,df,i,j)
                               1
Warning: Unused dummy argument 'i' at (1)
deriv_10th.f90:1682.33:

    subroutine der3i3j(f,k,df,i,j)
                                 1
Warning: Unused dummy argument 'j' at (1)
deriv_10th.f90:1682.26:

    subroutine der3i3j(f,k,df,i,j)
                          1
Warning: Unused dummy argument 'k' at (1)
deriv_10th.f90:1665.26:

    subroutine der2i2j2k(f,k,df)
                          1
Warning: Unused dummy argument 'f' at (1)
deriv_10th.f90:1673.33:

      real, dimension (nx) :: fac
                                 1
Warning: Unused variable 'fac' declared at (1)
deriv_10th.f90:1665.28:

    subroutine der2i2j2k(f,k,df)
                            1
Warning: Unused dummy argument 'k' at (1)
deriv_10th.f90:1651.29:

    subroutine der4i2j(f,k,df,i,j)
                             1
Warning: Unused dummy argument 'df' at (1)
deriv_10th.f90:1651.24:

    subroutine der4i2j(f,k,df,i,j)
                        1
Warning: Unused dummy argument 'f' at (1)
deriv_10th.f90:1658.36:

      real, dimension (nx) :: df,fac
                                    1
Warning: Unused variable 'fac' declared at (1)
deriv_10th.f90:1651.31:

    subroutine der4i2j(f,k,df,i,j)
                               1
Warning: Unused dummy argument 'i' at (1)
deriv_10th.f90:1651.33:

    subroutine der4i2j(f,k,df,i,j)
                                 1
Warning: Unused dummy argument 'j' at (1)
deriv_10th.f90:1651.26:

    subroutine der4i2j(f,k,df,i,j)
                          1
Warning: Unused dummy argument 'k' at (1)
file_io_common.inc:305.38:
    Included at file_io_f95.f90:346:

      if (name /= '') type = '_'//type
                                      1
Warning: CHARACTER expression will be truncated in assignment (5/6) at (1)
file_io_common.inc:39.12:
    Included at file_io_f95.f90:346:

      len = rec_len
            1
Warning: Possible change of value in conversion from INTEGER(8) to INTEGER(4) at (1)
file_io_common.inc:40.12:
    Included at file_io_f95.f90:346:

      num = num_rec
            1
Warning: Possible change of value in conversion from INTEGER(8) to INTEGER(4) at (1)
file_io_common.inc:12.58:
    Included at file_io_f95.f90:346:

    subroutine fseek_pos(unit, rec_len, num_rec, reference)
                                                          1
Warning: Unused dummy argument 'reference' at (1)
file_io_f95.f90:184:0: warning: ‘write_binary_file_str’ defined but not used [-Wunused-function]
     subroutine write_binary_file_str(file,bytes,buffer)
 ^
mpif90 -O -O0 -Wall -finit-real=NaN -finit-integer=-2147483648 -g -fbacktrace -fimplicit-none -fcheck=all -ffpe-trap=invalid,zero,overflow    -std=f95 -o sub.o -c sub.f90
sub.f90:7334.28:

      call traceless_strain(uij,sij2,uij,uu,lshear_rateofstrain)
                            1
Warning: Same actual argument associated with INTENT(IN) argument 'uij' and INTENT(OUT) argument 'sij' at (1)
sub.f90:5306.13:

      coeff1=(/0.66761295020790986D00, &
             1
Warning: Possible change of value in conversion from REAL(8) to REAL(4) at (1)
sub.f90:5314.13:

      coeff2=(/0.66761295020791116D00, &
             1
Warning: Possible change of value in conversion from REAL(8) to REAL(4) at (1)
sub.f90:3736.13:

      t_sp = t
             1
Warning: Possible change of value in conversion from REAL(8) to REAL(4) at (1)
sub.f90:3698.12:

        dt_=tsnap-t
            1
Warning: Possible change of value in conversion from REAL(8) to REAL(4) at (1)
sub.f90:3612.13:

        t_sp=log10(t)
             1
Warning: Possible change of value in conversion from REAL(8) to REAL(4) at (1)
sub.f90:3614.13:

        t_sp=t
             1
Warning: Possible change of value in conversion from REAL(8) to REAL(4) at (1)
sub.f90:3547.19:

            tout = log10(t)
                   1
Warning: Possible change of value in conversion from REAL(8) to REAL(4) at (1)
sub.f90:3551.19:

            tout = t0 + (dble(dtout) - modulo(t0, dble(dtout)))
                   1
Warning: Possible change of value in conversion from REAL(8) to REAL(4) at (1)
sub.f90:3572.13:

      nout = bcast_array(2)
             1
Warning: Possible change of value in conversion from REAL(4) to INTEGER(4) at (1)
sub.f90:373.14:

          res=sum(a*1.D0)     ! sum at double precision to improve accuracy
              1
Warning: Possible change of value in conversion from REAL(8) to REAL(4) at (1)
sub.f90:381.14:

          res=res+sum(a*1.D0)
              1
Warning: Possible change of value in conversion from REAL(8) to REAL(4) at (1)
sub.f90:4172.21:

      entry ylm_other(theta,phi,ell,emm,der) result (sph_har)
                     1
Warning: Unused variable 'ylm_other' declared at (1)
sub.f90:4575:0: warning: ‘nan_inform’ defined but not used [-Wunused-function]
     subroutine nan_inform(f,msg,region,int1,int2,int3,int4,lstop)
 ^
sub.f90:1443:0: warning: ‘der_2nd’ defined but not used [-Wunused-function]
     subroutine der_2nd(f,k,df,j)
 ^
sub.f90:625:0: warning: ‘contract_jk3’ defined but not used [-Wunused-function]
     subroutine contract_jk3(a,c)
 ^
sub.f90:494:0: warning: ‘rms2_mn’ defined but not used [-Wunused-function]
     subroutine rms2_mn(a2,res)
 ^
sub.f90:459:0: warning: ‘rms_mn’ defined but not used [-Wunused-function]
     subroutine rms_mn(a,res)
 ^
sub.f90:354:0: warning: ‘mean_mn’ defined but not used [-Wunused-function]
     subroutine mean_mn(a,res)
 ^
mpif90 -O -O0 -Wall -finit-real=NaN -finit-integer=-2147483648 -g -fbacktrace -fimplicit-none -fcheck=all -ffpe-trap=invalid,zero,overflow    -std=f95 -o diagnostics.o -c diagnostics.f90
mpif90 -O -O0 -Wall -finit-real=NaN -finit-integer=-2147483648 -g -fbacktrace -fimplicit-none -fcheck=all -ffpe-trap=invalid,zero,overflow    -std=f95 -o nofourier.o -c nofourier.f90
mpif90 -O -O0 -Wall -finit-real=NaN -finit-integer=-2147483648 -g -fbacktrace -fimplicit-none -fcheck=all -ffpe-trap=invalid,zero,overflow    -std=f95 -o io_dist.o -c io_dist.f90
mpif90 -O -O0 -Wall -finit-real=NaN -finit-integer=-2147483648 -g -fbacktrace -fimplicit-none -fcheck=all -ffpe-trap=invalid,zero,overflow    -std=f95 -o noshock.o -c noshock.f90
mpif90 -O -O0 -Wall -finit-real=NaN -finit-integer=-2147483648 -g -fbacktrace -fimplicit-none -fcheck=all -ffpe-trap=invalid,zero,overflow    -std=f95 -o nolorenz_gauge.o -c nolorenz_gauge.f90
mpif90 -O -O0 -Wall -finit-real=NaN -finit-integer=-2147483648 -g -fbacktrace -fimplicit-none -fcheck=all -ffpe-trap=invalid,zero,overflow    -std=f95 -o nodebug.o -c nodebug.f90
mpif90 -O -O0 -Wall -finit-real=NaN -finit-integer=-2147483648 -g -fbacktrace -fimplicit-none -fcheck=all -ffpe-trap=invalid,zero,overflow    -std=f95 -o nostreamlines.o -c nostreamlines.f90
mpif90 -O -O0 -Wall -finit-real=NaN -finit-integer=-2147483648 -g -fbacktrace -fimplicit-none -fcheck=all -ffpe-trap=invalid,zero,overflow    -std=f95 -o nosignal_handling.o -c nosignal_handling.f90
mpif90 -O -O0 -Wall -finit-real=NaN -finit-integer=-2147483648 -g -fbacktrace -fimplicit-none -fcheck=all -ffpe-trap=invalid,zero,overflow    -std=f95 -o nofixed_point.o -c nofixed_point.f90
io_dist.f90:1283.23:

          procx_bounds=procx_boundsdb; procy_bounds=procy_boundsdb; procz_bound
                       1
Warning: Possible change of value in conversion from REAL(8) to REAL(4) at (1)
io_dist.f90:1283.52:

          procx_bounds=procx_boundsdb; procy_bounds=procy_boundsdb; procz_bound
                                                    1
Warning: Possible change of value in conversion from REAL(8) to REAL(4) at (1)
io_dist.f90:1283.81:

    procx_bounds=procx_boundsdb; procy_bounds=procy_boundsdb; procz_bounds=proc
                                                                           1
Warning: Possible change of value in conversion from REAL(8) to REAL(4) at (1)
io_dist.f90:1211.14:

            x=xdb; y=ydb; z=zdb; dx=dxdb; dy=dydb; dz=dzdb
              1
Warning: Possible change of value in conversion from REAL(8) to REAL(4) at (1)
io_dist.f90:1211.21:

            x=xdb; y=ydb; z=zdb; dx=dxdb; dy=dydb; dz=dzdb
                     1
Warning: Possible change of value in conversion from REAL(8) to REAL(4) at (1)
io_dist.f90:1211.28:

            x=xdb; y=ydb; z=zdb; dx=dxdb; dy=dydb; dz=dzdb
                            1
Warning: Possible change of value in conversion from REAL(8) to REAL(4) at (1)
io_dist.f90:1211.36:

            x=xdb; y=ydb; z=zdb; dx=dxdb; dy=dydb; dz=dzdb
                                    1
Warning: Possible change of value in conversion from REAL(8) to REAL(4) at (1)
io_dist.f90:1211.45:

            x=xdb; y=ydb; z=zdb; dx=dxdb; dy=dydb; dz=dzdb
                                             1
Warning: Possible change of value in conversion from REAL(8) to REAL(4) at (1)
io_dist.f90:1211.54:

            x=xdb; y=ydb; z=zdb; dx=dxdb; dy=dydb; dz=dzdb
                                                      1
Warning: Possible change of value in conversion from REAL(8) to REAL(4) at (1)
io_dist.f90:1212.15:

            Lx=Lxdb; Ly=Lydb; Lz=Lzdb; dx_1=dx_1db; dy_1=dy_1db; dz_1=dz_1db
               1
Warning: Possible change of value in conversion from REAL(8) to REAL(4) at (1)
io_dist.f90:1212.24:

            Lx=Lxdb; Ly=Lydb; Lz=Lzdb; dx_1=dx_1db; dy_1=dy_1db; dz_1=dz_1db
                        1
Warning: Possible change of value in conversion from REAL(8) to REAL(4) at (1)
io_dist.f90:1212.33:

            Lx=Lxdb; Ly=Lydb; Lz=Lzdb; dx_1=dx_1db; dy_1=dy_1db; dz_1=dz_1db
                                 1
Warning: Possible change of value in conversion from REAL(8) to REAL(4) at (1)
io_dist.f90:1212.44:

            Lx=Lxdb; Ly=Lydb; Lz=Lzdb; dx_1=dx_1db; dy_1=dy_1db; dz_1=dz_1db
                                            1
Warning: Possible change of value in conversion from REAL(8) to REAL(4) at (1)
io_dist.f90:1212.57:

            Lx=Lxdb; Ly=Lydb; Lz=Lzdb; dx_1=dx_1db; dy_1=dy_1db; dz_1=dz_1db
                                                         1
Warning: Possible change of value in conversion from REAL(8) to REAL(4) at (1)
io_dist.f90:1212.70:

            Lx=Lxdb; Ly=Lydb; Lz=Lzdb; dx_1=dx_1db; dy_1=dy_1db; dz_1=dz_1db
                                                                      1
Warning: Possible change of value in conversion from REAL(8) to REAL(4) at (1)
io_dist.f90:1213.21:

            dx_tilde=dx_tildedb; dy_tilde=dy_tildedb; dz_tilde=dz_tildedb
                     1
Warning: Possible change of value in conversion from REAL(8) to REAL(4) at (1)
io_dist.f90:1213.42:

            dx_tilde=dx_tildedb; dy_tilde=dy_tildedb; dz_tilde=dz_tildedb
                                          1
Warning: Possible change of value in conversion from REAL(8) to REAL(4) at (1)
io_dist.f90:1213.63:

            dx_tilde=dx_tildedb; dy_tilde=dy_tildedb; dz_tilde=dz_tildedb
                                                               1
Warning: Possible change of value in conversion from REAL(8) to REAL(4) at (1)
io_dist.f90:1065.13:

      t_sp = t
             1
Warning: Possible change of value in conversion from REAL(8) to REAL(4) at (1)
io_dist.f90:1089.15:

        t_sp = t
               1
Warning: Possible change of value in conversion from REAL(8) to REAL(4) at (1)
io_dist.f90:946.12:

          a=adb
            1
Warning: Possible change of value in conversion from REAL(8) to REAL(4) at (1)
io_dist.f90:874.16:

          value=vdb
                1
Warning: Possible change of value in conversion from REAL(8) to REAL(4) at (1)
io_dist.f90:844.16:

          value=vdb
                1
Warning: Possible change of value in conversion from REAL(8) to REAL(4) at (1)
io_dist.f90:642.19:

          t_test = t_sp
                   1
Warning: Possible change of value in conversion from REAL(8) to REAL(4) at (1)
io_dist.f90:663.21:

              tstart=t_dbl
                     1
Warning: Possible change of value in conversion from REAL(8) to REAL(4) at (1)
io_dist.f90:671.19:

            tstart=t_sp
                   1
Warning: Possible change of value in conversion from REAL(8) to REAL(4) at (1)
io_dist.f90:389.12:

          a=adb; x=xdb; y=ydb; z=zdb; dx=dxdb; dy=dydb; dz=dzdb; deltay=deltaydb
            1
Warning: Possible change of value in conversion from REAL(8) to REAL(4) at (1)
io_dist.f90:389.19:

          a=adb; x=xdb; y=ydb; z=zdb; dx=dxdb; dy=dydb; dz=dzdb; deltay=deltaydb
                   1
Warning: Possible change of value in conversion from REAL(8) to REAL(4) at (1)
io_dist.f90:389.26:

          a=adb; x=xdb; y=ydb; z=zdb; dx=dxdb; dy=dydb; dz=dzdb; deltay=deltaydb
                          1
Warning: Possible change of value in conversion from REAL(8) to REAL(4) at (1)
io_dist.f90:389.33:

          a=adb; x=xdb; y=ydb; z=zdb; dx=dxdb; dy=dydb; dz=dzdb; deltay=deltaydb
                                 1
Warning: Possible change of value in conversion from REAL(8) to REAL(4) at (1)
io_dist.f90:389.41:

          a=adb; x=xdb; y=ydb; z=zdb; dx=dxdb; dy=dydb; dz=dzdb; deltay=deltaydb
                                         1
Warning: Possible change of value in conversion from REAL(8) to REAL(4) at (1)
io_dist.f90:389.50:

          a=adb; x=xdb; y=ydb; z=zdb; dx=dxdb; dy=dydb; dz=dzdb; deltay=deltaydb
                                                  1
Warning: Possible change of value in conversion from REAL(8) to REAL(4) at (1)
io_dist.f90:389.59:

          a=adb; x=xdb; y=ydb; z=zdb; dx=dxdb; dy=dydb; dz=dzdb; deltay=deltaydb
                                                           1
Warning: Possible change of value in conversion from REAL(8) to REAL(4) at (1)
io_dist.f90:389.72:

          a=adb; x=xdb; y=ydb; z=zdb; dx=dxdb; dy=dydb; dz=dzdb; deltay=deltaydb
                                                                        1
Warning: Possible change of value in conversion from REAL(8) to REAL(4) at (1)
io_dist.f90:146.13:

      t_sp = t
             1
Warning: Possible change of value in conversion from REAL(8) to REAL(4) at (1)
io_dist.f90:857.47:

    logical function read_persist_real_1D(label, value)
                                               1
Warning: Unused dummy argument 'label' at (1)
io_dist.f90:828.47:

    logical function read_persist_real_0D(label, value)
                                               1
Warning: Unused dummy argument 'label' at (1)
io_dist.f90:814.46:

    logical function read_persist_int_1D(label, value)
                                              1
Warning: Unused dummy argument 'label' at (1)
io_dist.f90:800.46:

    logical function read_persist_int_0D(label, value)
                                              1
Warning: Unused dummy argument 'label' at (1)
io_dist.f90:786.50:

    logical function read_persist_logical_1D(label, value)
                                                  1
Warning: Unused dummy argument 'label' at (1)
io_dist.f90:772.50:

    logical function read_persist_logical_0D(label, value)
                                                  1
Warning: Unused dummy argument 'label' at (1)
io_dist.f90:236.43:

    logical function write_persist_id(label, id)
                                           1
Warning: Unused dummy argument 'label' at (1)
mpif90 -O -O0 -Wall -finit-real=NaN -finit-integer=-2147483648 -g -fbacktrace -fimplicit-none -fcheck=all -ffpe-trap=invalid,zero,overflow    -std=f95 -o nopoisson.o -c nopoisson.f90
mpif90 -O -O0 -Wall -finit-real=NaN -finit-integer=-2147483648 -g -fbacktrace -fimplicit-none -fcheck=all -ffpe-trap=invalid,zero,overflow    -std=f95 -o nohyperresi_strict.o -c nohyperresi_strict.f90
mpif90 -O -O0 -Wall -finit-real=NaN -finit-integer=-2147483648 -g -fbacktrace -fimplicit-none -fcheck=all -ffpe-trap=invalid,zero,overflow    -std=f95 -o nohypervisc_strict.o -c nohypervisc_strict.f90
mpif90 -O -O0 -Wall -finit-real=NaN -finit-integer=-2147483648 -g -fbacktrace -fimplicit-none -fcheck=all -ffpe-trap=invalid,zero,overflow    -std=f95 -o noghostfold.o -c noghostfold.f90
mpif90 -O -O0 -Wall -finit-real=NaN -finit-integer=-2147483648 -g -fbacktrace -fimplicit-none -fcheck=all -ffpe-trap=invalid,zero,overflow    -std=f95 -o grid.o -c grid.f90
mpif90 -O -O0 -Wall -finit-real=NaN -finit-integer=-2147483648 -g -fbacktrace -fimplicit-none -fcheck=all -ffpe-trap=invalid,zero,overflow    -std=f95 -o noborder_profiles.o -c noborder_profiles.f90
grid.f90:1929.11:

           dxyz(1)*0.5*(xi-delta(1)*log(cosh(dble((xi-xistep(1))/delta(1))))) +
           1
Warning: Possible change of value in conversion from REAL(8) to REAL(4) at (1)
grid.f90:1936.14:

              dxyz(1)*0.5*(1.0-tanh(dble((xi-xistep(1))/delta(1))) ) +  &
              1
Warning: Possible change of value in conversion from REAL(8) to REAL(4) at (1)
grid.f90:1944.16:

                + 0.5/delta(1)*(dxyz(2)-dxyz(1))/cosh(dble((xi-xistep(1))/delta
                1
Warning: Possible change of value in conversion from REAL(8) to REAL(4) at (1)
grid.f90:1949.11:

           dxyz(2)*0.5*(xi-delta(2)*log(cosh(dble((xi-xistep(2))/delta(2)))) )+
           1
Warning: Possible change of value in conversion from REAL(8) to REAL(4) at (1)
grid.f90:1954.14:

              dxyz(2)*0.5*(1.0-tanh(dble((xi-xistep(2))/delta(2))) ) +  &
              1
Warning: Possible change of value in conversion from REAL(8) to REAL(4) at (1)
grid.f90:1960.16:

                + 0.5/delta(2)*(dxyz(3)-dxyz(2))/cosh(dble((xi-xistep(2))/delta
                1
Warning: Possible change of value in conversion from REAL(8) to REAL(4) at (1)
mpif90 -O -O0 -Wall -finit-real=NaN -finit-integer=-2147483648 -g -fbacktrace -fimplicit-none -fcheck=all -ffpe-trap=invalid,zero,overflow    -std=f95 -o nodensity_methods.o -c nodensity_methods.f90
mpif90 -O -O0 -Wall -finit-real=NaN -finit-integer=-2147483648 -g -fbacktrace -fimplicit-none -fcheck=all -ffpe-trap=invalid,zero,overflow    -std=f95 -o nogravity.o -c nogravity.f90
mpif90 -O -O0 -Wall -finit-real=NaN -finit-integer=-2147483648 -g -fbacktrace -fimplicit-none -fcheck=all -ffpe-trap=invalid,zero,overflow    -std=f95 -o noinitial_condition.o -c noinitial_condition.f90
mpif90 -O -O0 -Wall -finit-real=NaN -finit-integer=-2147483648 -g -fbacktrace -fimplicit-none -fcheck=all -ffpe-trap=invalid,zero,overflow    -std=f95 -o nospecial.o -c nospecial.f90
mpif90 -O -O0 -Wall -finit-real=NaN -finit-integer=-2147483648 -g -fbacktrace -fimplicit-none -fcheck=all -ffpe-trap=invalid,zero,overflow    -std=f95 -o noparticles_main.o -c noparticles_main.f90
mpif90 -O -O0 -Wall -finit-real=NaN -finit-integer=-2147483648 -g -fbacktrace -fimplicit-none -fcheck=all -ffpe-trap=invalid,zero,overflow    -std=f95 -o noshear.o -c noshear.f90
mpif90 -O -O0 -Wall -finit-real=NaN -finit-integer=-2147483648 -g -fbacktrace -fimplicit-none -fcheck=all -ffpe-trap=invalid,zero,overflow    -std=f95 -o noopacity.o -c noopacity.f90
mpif90 -O -O0 -Wall -finit-real=NaN -finit-integer=-2147483648 -g -fbacktrace -fimplicit-none -fcheck=all -ffpe-trap=invalid,zero,overflow    -std=f95 -o nopower_spectrum.o -c nopower_spectrum.f90
mpif90 -O -O0 -Wall -finit-real=NaN -finit-integer=-2147483648 -g -fbacktrace -fimplicit-none -fcheck=all -ffpe-trap=invalid,zero,overflow    -std=f95 -o nostruct_func.o -c nostruct_func.f90
mpif90 -O -O0 -Wall -finit-real=NaN -finit-integer=-2147483648 -g -fbacktrace -fimplicit-none -fcheck=all -ffpe-trap=invalid,zero,overflow    -std=f95 -o notimeavg.o -c notimeavg.f90
nodensity_methods.f90:145.28:

    subroutine getdlnrho_y(f,im,dlnrho)
                            1
Warning: Unused dummy argument 'f' at (1)
nodensity_methods.f90:134.28:

    subroutine getdlnrho_x(f,il,ix,rho,dlnrho)
                            1
Warning: Unused dummy argument 'f' at (1)
nodensity_methods.f90:134.34:

    subroutine getdlnrho_x(f,il,ix,rho,dlnrho)
                                  1
Warning: Unused dummy argument 'ix' at (1)
nodensity_methods.f90:134.38:

    subroutine getdlnrho_x(f,il,ix,rho,dlnrho)
                                      1
Warning: Unused dummy argument 'rho' at (1)
nodensity_methods.f90:124.28:

    subroutine getdlnrho_z(f,in,dlnrho)
                            1
Warning: Unused dummy argument 'f' at (1)
nodensity_methods.f90:114.28:

    subroutine getrho_2dyz(f,ix,rho)
                            1
Warning: Unused dummy argument 'f' at (1)
nodensity_methods.f90:114.31:

    subroutine getrho_2dyz(f,ix,rho)
                               1
Warning: Unused dummy argument 'ix' at (1)
nodensity_methods.f90:105.26:

    subroutine getrho_2d(f,rho)
                          1
Warning: Unused dummy argument 'f' at (1)
nodensity_methods.f90:95.30:

    subroutine getlnrho_2dyz(f,ix,lnrho)
                              1
Warning: Unused dummy argument 'f' at (1)
nodensity_methods.f90:95.33:

    subroutine getlnrho_2dyz(f,ix,lnrho)
                                 1
Warning: Unused dummy argument 'ix' at (1)
nodensity_methods.f90:86.28:

    subroutine getlnrho_2d(f,lnrho)
                            1
Warning: Unused dummy argument 'f' at (1)
nodensity_methods.f90:76.30:

    subroutine getlnrho_1d_y(f,ix,lnrho)
                              1
Warning: Unused dummy argument 'f' at (1)
nodensity_methods.f90:76.33:

    subroutine getlnrho_1d_y(f,ix,lnrho)
                                 1
Warning: Unused dummy argument 'ix' at (1)
nodensity_methods.f90:67.30:

    subroutine getlnrho_1d_x(f,lnrho)
                              1
Warning: Unused dummy argument 'f' at (1)
nodensity_methods.f90:58.26:

    subroutine getrho_1d(f,rho)
                          1
Warning: Unused dummy argument 'f' at (1)
nodensity_methods.f90:48.23:

    function getrho_s(f,irf)
                       1
Warning: Unused dummy argument 'f' at (1)
nodensity_methods.f90:48.27:

    function getrho_s(f,irf)
                           1
Warning: Unused dummy argument 'irf' at (1)
mpif90 -O -O0 -Wall -finit-real=NaN -finit-integer=-2147483648 -g -fbacktrace -fimplicit-none -fcheck=all -ffpe-trap=invalid,zero,overflow    -std=f95 -o noeos.o -c noeos.f90
mpif90 -O -O0 -Wall -finit-real=NaN -finit-integer=-2147483648 -g -fbacktrace -fimplicit-none -fcheck=all -ffpe-trap=invalid,zero,overflow    -std=f95 -o nopointmasses.o -c nopointmasses.f90
ar r noparticles_main.a noparticles_main.o
ar: creating noparticles_main.a
nopointmasses.f90:193.44:

    subroutine pointmasses_timestep_second(f)
                                            1
Warning: Unused dummy argument 'f' at (1)
nopointmasses.f90:187.43:

    subroutine pointmasses_timestep_first(f)
                                           1
Warning: Unused dummy argument 'f' at (1)
nopointmasses.f90:168.46:

    subroutine pointmasses_write_qdim(filename)
                                              1
Warning: Unused dummy argument 'filename' at (1)
nopointmasses.f90:158.55:

    subroutine pointmasses_write_snapshot(snapbase,enum,flist)
                                                       1
Warning: Unused dummy argument 'enum' at (1)
nopointmasses.f90:158.50:

    subroutine pointmasses_write_snapshot(snapbase,enum,flist)
                                                  1
Warning: Unused dummy argument 'snapbase' at (1)
nopointmasses.f90:152.49:

    subroutine pointmasses_read_snapshot(filename)
                                                 1
Warning: Unused dummy argument 'filename' at (1)
nopointmasses.f90:146.34:

    subroutine get_totalmass(tmass)
                                  1
Warning: Unused dummy argument 'tmass' at (1)
mpif90 -O -O0 -Wall -finit-real=NaN -finit-integer=-2147483648 -g -fbacktrace -fimplicit-none -fcheck=all -ffpe-trap=invalid,zero,overflow    -std=f95 -o magnetic/nomeanfield_demfdt.o -c magnetic/nomeanfield_demfdt.f90
noeos.f90:1011.47:

    subroutine bc_ss_temp_z(f,topbot,lone_sided)
                                               1
Warning: Unused dummy argument 'lone_sided' at (1)
noeos.f90:564.45:

    subroutine bc_ss_flux(f,topbot,lone_sided)
                                             1
Warning: Unused dummy argument 'lone_sided' at (1)
mpif90 -O -O0 -Wall -finit-real=NaN -finit-integer=-2147483648 -g -fbacktrace -fimplicit-none -fcheck=all -ffpe-trap=invalid,zero,overflow    -std=f95 -o magnetic/nomeanfield.o -c magnetic/nomeanfield.f90
mpif90 -O -O0 -Wall -finit-real=NaN -finit-integer=-2147483648 -g -fbacktrace -fimplicit-none -fcheck=all -ffpe-trap=invalid,zero,overflow    -std=f95 -o initcond.o -c initcond.f90
mpif90 -O -O0 -Wall -finit-real=NaN -finit-integer=-2147483648 -g -fbacktrace -fimplicit-none -fcheck=all -ffpe-trap=invalid,zero,overflow    -std=f95 -o nointerstellar.o -c nointerstellar.f90
mpif90 -O -O0 -Wall -finit-real=NaN -finit-integer=-2147483648 -g -fbacktrace -fimplicit-none -fcheck=all -ffpe-trap=invalid,zero,overflow    -std=f95 -o boundcond.o -c boundcond.f90
mpif90 -O -O0 -Wall -finit-real=NaN -finit-integer=-2147483648 -g -fbacktrace -fimplicit-none -fcheck=all -ffpe-trap=invalid,zero,overflow    -std=f95 -o noheatflux.o -c noheatflux.f90
mpif90 -O -O0 -Wall -finit-real=NaN -finit-integer=-2147483648 -g -fbacktrace -fimplicit-none -fcheck=all -ffpe-trap=invalid,zero,overflow    -std=f95 -o noselfgravity.o -c noselfgravity.f90
initcond.f90:6093.19:

      mass_cloud = (mass_cloud * M_sun) / unit_mass
                   1
Warning: Possible change of value in conversion from REAL(8) to REAL(4) at (1)
initcond.f90:6111.18:

           bigr = var1/unit_length
                  1
Warning: Possible change of value in conversion from REAL(8) to REAL(4) at (1)
initcond.f90:6116.25:

             r_rho(jj) = var1/unit_length
                         1
Warning: Possible change of value in conversion from REAL(8) to REAL(4) at (1)
initcond.f90:6117.27:

             lnrho_r(jj) = log(var2/unit_density)
                           1
Warning: Possible change of value in conversion from REAL(8) to REAL(4) at (1)
initcond.f90:6118.29:

             lnTT_file(jj) = log(var3/unit_temperature)
                             1
Warning: Possible change of value in conversion from REAL(8) to REAL(4) at (1)
initcond.f90:6179.18:

           bigr = var1/unit_length
                  1
Warning: Possible change of value in conversion from REAL(8) to REAL(4) at (1)
initcond.f90:6180.24:

           lnTTpoint0 = log(var2*temp_coeff/unit_temperature)
                        1
Warning: Possible change of value in conversion from REAL(8) to REAL(4) at (1)
initcond.f90:6185.25:

             r_rho(jj) = var1/unit_length
                         1
Warning: Possible change of value in conversion from REAL(8) to REAL(4) at (1)
initcond.f90:6186.27:

             lnrho_r(jj) = log(var2*dens_coeff/unit_density)
                           1
Warning: Possible change of value in conversion from REAL(8) to REAL(4) at (1)
initcond.f90:5849.30:

        do icpu=nprocy+1,ncpus
                              1
Warning: DO loop at (1) will be executed zero times
initcond.f90:5777.30:

        do icpu=nprocy+1,ncpus
                              1
Warning: DO loop at (1) will be executed zero times
initcond.f90:5675.15:

      prof_z = prof_z*1.e6/unit_length
               1
Warning: Possible change of value in conversion from REAL(8) to REAL(4) at (1)
initcond.f90:5559.28:

        do py = 1, nprocxy-1
                            1
Warning: DO loop at (1) will be executed zero times
initcond.f90:5581.29:

          do pz = 1, nprocz-1
                             1
Warning: DO loop at (1) will be executed zero times
initcond.f90:5592.11:

      Bz = Bz * 1e-4 / unit_magnetic
           1
Warning: Possible change of value in conversion from REAL(8) to REAL(4) at (1)
initcond.f90:5596.26:

          Bz_flux_local = sum(abs(Bz)) * dy * unit_magnetic*unit_length
                          1
Warning: Possible change of value in conversion from REAL(8) to REAL(4) at (1)
initcond.f90:5600.26:

          Bz_flux_local = sum(abs(Bz)) * dx * unit_magnetic*unit_length
                          1
Warning: Possible change of value in conversion from REAL(8) to REAL(4) at (1)
initcond.f90:5604.26:

          Bz_flux_local = sum(abs(Bz)) * dx*dy * unit_magnetic*unit_length**2
                          1
Warning: Possible change of value in conversion from REAL(8) to REAL(4) at (1)
initcond.f90:5421.20:

          Bzflux =  sum(abs(Bz0_r * 1e-4))*dy*unit_length
                    1
Warning: Possible change of value in conversion from REAL(8) to REAL(4) at (1)
initcond.f90:5424.20:

          Bzflux =  sum(abs(Bz0_r * 1e-4))*dx*unit_length
                    1
Warning: Possible change of value in conversion from REAL(8) to REAL(4) at (1)
initcond.f90:5427.20:

          Bzflux =  sum(abs(Bz0_r * 1e-4))*dx*unit_length*dy*unit_length
                    1
Warning: Possible change of value in conversion from REAL(8) to REAL(4) at (1)
initcond.f90:5433.14:

      Bz0_r = Bz0_r * 1e-4 / unit_magnetic ! Gauss to Tesla and SI to PENCIL un
              1
Warning: Possible change of value in conversion from REAL(8) to REAL(4) at (1)
initcond.f90:5263.15:

      prof_z = prof_z*1.e6/unit_length
               1
Warning: Possible change of value in conversion from REAL(8) to REAL(4) at (1)
boundcond.f90:8158.21:

      density_scale1=unit_length/density_scale_cgs
                     1
Warning: Possible change of value in conversion from REAL(8) to REAL(4) at (1)
boundcond.f90:8021.25:

          do j=1,nprocx-1
                         1
Warning: DO loop at (1) will be executed zero times
boundcond.f90:8044.27:

            do j=1,nprocx-1
                           1
Warning: DO loop at (1) will be executed zero times
boundcond.f90:7853.23:

        f(:,:,idz,j) = spread(ampl_forc*sin(kx*x)*cos(w_forc*t), 2, size(f,2))
                       1
Warning: Possible change of value in conversion from REAL(8) to REAL(4) at (1)
boundcond.f90:7855.23:

        f(:,:,idz,j) = spread(ampl_forc*exp(-((x-x_forc)/dx_forc)**2)*cos(w_for
                       1
Warning: Possible change of value in conversion from REAL(8) to REAL(4) at (1)
boundcond.f90:5369.24:

        do i=1,nprocxy-1
                        1
Warning: DO loop at (1) will be executed zero times
boundcond.f90:5404.16:

      time_SI = t*unit_time
                1
Warning: Possible change of value in conversion from REAL(8) to REAL(4) at (1)
boundcond.f90:5496.28:

          do py=1, nprocxy-1
                            1
Warning: DO loop at (1) will be executed zero times
boundcond.f90:5533.16:

        Bz0_l = Bz0_l * 1e-4 / unit_magnetic
                1
Warning: Possible change of value in conversion from REAL(8) to REAL(4) at (1)
boundcond.f90:5534.16:

        Bz0_r = Bz0_r * 1e-4 / unit_magnetic
                1
Warning: Possible change of value in conversion from REAL(8) to REAL(4) at (1)
boundcond.f90:5537.17:

          vx_l = vx_l / unit_velocity
                 1
Warning: Possible change of value in conversion from REAL(8) to REAL(4) at (1)
boundcond.f90:5538.17:

          vy_l = vy_l / unit_velocity
                 1
Warning: Possible change of value in conversion from REAL(8) to REAL(4) at (1)
boundcond.f90:5539.17:

          vx_r = vx_r / unit_velocity
                 1
Warning: Possible change of value in conversion from REAL(8) to REAL(4) at (1)
boundcond.f90:5540.17:

          vy_r = vy_r / unit_velocity
                 1
Warning: Possible change of value in conversion from REAL(8) to REAL(4) at (1)
boundcond.f90:5087.25:

               delta_t = t*unit_time                  ! EOF is reached => read 
                         1
Warning: Possible change of value in conversion from REAL(8) to REAL(4) at (1)
boundcond.f90:5171.15:

         uxl = uxl / 10. / unit_velocity
               1
Warning: Possible change of value in conversion from REAL(8) to REAL(4) at (1)
boundcond.f90:5172.15:

         uxr = uxr / 10. / unit_velocity
               1
Warning: Possible change of value in conversion from REAL(8) to REAL(4) at (1)
boundcond.f90:5173.15:

         uyl = uyl / 10. / unit_velocity
               1
Warning: Possible change of value in conversion from REAL(8) to REAL(4) at (1)
boundcond.f90:5174.15:

         uyr = uyr / 10. / unit_velocity
               1
Warning: Possible change of value in conversion from REAL(8) to REAL(4) at (1)
boundcond.f90:5181.16:

         uxd  = (t*unit_time - (tl+delta_t)) * (uxr - uxl) / (tr - tl) + uxl
                1
Warning: Possible change of value in conversion from REAL(8) to REAL(4) at (1)
boundcond.f90:5182.16:

         uyd  = (t*unit_time - (tl+delta_t)) * (uyr - uyl) / (tr - tl) + uyl
                1
Warning: Possible change of value in conversion from REAL(8) to REAL(4) at (1)
boundcond.f90:4773.27:

           f(l1,:,:,iuy) = spread(ampl_forc*sin(k_forc*y)*cos(w_forc*t), 2, siz
                           1
Warning: Possible change of value in conversion from REAL(8) to REAL(4) at (1)
boundcond.f90:4795.28:

            f(l2,:,:,iuy) = spread(ampl_forc*sin(k_forc*y)*cos(w_forc*t), 2, si
                            1
Warning: Possible change of value in conversion from REAL(8) to REAL(4) at (1)
boundcond.f90:4453.18:

            tau = (t-tfade_start) / (tdamp-tfade_start) - 0.5
                  1
Warning: Possible change of value in conversion from REAL(8) to REAL(4) at (1)
boundcond.f90:2874.12:

        lbc=Udrift_bc*t*dx_1(1)+1.
            1
Warning: Possible change of value in conversion from REAL(8) to REAL(4) at (1)
boundcond.f90:2888.12:

        lbc=Udrift_bc*t*dx_1(1)+1.
            1
Warning: Possible change of value in conversion from REAL(8) to REAL(4) at (1)
boundcond.f90:3884:0: warning: ‘bc_onesided_z_orig’ defined but not used [-Wunused-function]
     subroutine bc_onesided_z_orig(f,topbot,j)
 ^
mpif90 -O -O0 -Wall -finit-real=NaN -finit-integer=-2147483648 -g -fbacktrace -fimplicit-none -fcheck=all -ffpe-trap=invalid,zero,overflow    -std=f95 -o nochemistry.o -c nochemistry.f90
mpif90 -O -O0 -Wall -finit-real=NaN -finit-integer=-2147483648 -g -fbacktrace -fimplicit-none -fcheck=all -ffpe-trap=invalid,zero,overflow    -std=f95 -o nochiral.o -c nochiral.f90
mpif90 -O -O0 -Wall -finit-real=NaN -finit-integer=-2147483648 -g -fbacktrace -fimplicit-none -fcheck=all -ffpe-trap=invalid,zero,overflow    -std=f95 -o nocosmicray.o -c nocosmicray.f90
mpif90 -O -O0 -Wall -finit-real=NaN -finit-integer=-2147483648 -g -fbacktrace -fimplicit-none -fcheck=all -ffpe-trap=invalid,zero,overflow    -std=f95 -o nopscalar.o -c nopscalar.f90
mpif90 -O -O0 -Wall -finit-real=NaN -finit-integer=-2147483648 -g -fbacktrace -fimplicit-none -fcheck=all -ffpe-trap=invalid,zero,overflow    -std=f95 -o noradiation.o -c noradiation.f90
mpif90 -O -O0 -Wall -finit-real=NaN -finit-integer=-2147483648 -g -fbacktrace -fimplicit-none -fcheck=all -ffpe-trap=invalid,zero,overflow    -std=f95 -o noneutraldensity.o -c noneutraldensity.f90
mpif90 -O -O0 -Wall -finit-real=NaN -finit-integer=-2147483648 -g -fbacktrace -fimplicit-none -fcheck=all -ffpe-trap=invalid,zero,overflow    -std=f95 -o nopolymer.o -c nopolymer.f90
mpif90 -O -O0 -Wall -finit-real=NaN -finit-integer=-2147483648 -g -fbacktrace -fimplicit-none -fcheck=all -ffpe-trap=invalid,zero,overflow    -std=f95 -o nosupersat.o -c nosupersat.f90
nosupersat.f90:78.40:

    subroutine calc_pencils_supersat(f,p)
                                        1
Warning: Unused dummy argument 'p' at (1)
mpif90 -O -O0 -Wall -finit-real=NaN -finit-integer=-2147483648 -g -fbacktrace -fimplicit-none -fcheck=all -ffpe-trap=invalid,zero,overflow    -std=f95 -o noneutralvelocity.o -c noneutralvelocity.f90
mpif90 -O -O0 -Wall -finit-real=NaN -finit-integer=-2147483648 -g -fbacktrace -fimplicit-none -fcheck=all -ffpe-trap=invalid,zero,overflow    -std=f95 -o nolsode_for_chemistry.o -c nolsode_for_chemistry.f90
mpif90 -O -O0 -Wall -finit-real=NaN -finit-integer=-2147483648 -g -fbacktrace -fimplicit-none -fcheck=all -ffpe-trap=invalid,zero,overflow    -std=f95 -o nodensity.o -c nodensity.f90
mpif90 -O -O0 -Wall -finit-real=NaN -finit-integer=-2147483648 -g -fbacktrace -fimplicit-none -fcheck=all -ffpe-trap=invalid,zero,overflow    -std=f95 -o noviscosity.o -c noviscosity.f90
mpif90 -O -O0 -Wall -finit-real=NaN -finit-integer=-2147483648 -g -fbacktrace -fimplicit-none -fcheck=all -ffpe-trap=invalid,zero,overflow    -std=f95 -o noimplicit_physics.o -c noimplicit_physics.f90
mpif90 -O -O0 -Wall -finit-real=NaN -finit-integer=-2147483648 -g -fbacktrace -fimplicit-none -fcheck=all -ffpe-trap=invalid,zero,overflow    -std=f95 -o nodetonate.o -c nodetonate.f90
mpif90 -O -O0 -Wall -finit-real=NaN -finit-integer=-2147483648 -g -fbacktrace -fimplicit-none -fcheck=all -ffpe-trap=invalid,zero,overflow    -std=f95 -o filter.o -c filter.f90
filter.f90:274:0: warning: ‘rmwig_lnxyaverage’ defined but not used [-Wunused-function]
     subroutine rmwig_lnxyaverage(f,ivar)
 ^
filter.f90:146:0: warning: ‘rmwig_old’ defined but not used [-Wunused-function]
     subroutine rmwig_old(f,df,ivar,explog)
 ^
mpif90 -O -O0 -Wall -finit-real=NaN -finit-integer=-2147483648 -g -fbacktrace -fimplicit-none -fcheck=all -ffpe-trap=invalid,zero,overflow    -std=f95 -o noforcing.o -c noforcing.f90
mpif90 -O -O0 -Wall -finit-real=NaN -finit-integer=-2147483648 -g -fbacktrace -fimplicit-none -fcheck=all -ffpe-trap=invalid,zero,overflow    -std=f95 -o noNSCBC.o -c noNSCBC.f90
mpif90 -O -O0 -Wall -finit-real=NaN -finit-integer=-2147483648 -g -fbacktrace -fimplicit-none -fcheck=all -ffpe-trap=invalid,zero,overflow    -std=f95 -o noentropy.o -c noentropy.f90
mpif90 -O -O0 -Wall -finit-real=NaN -finit-integer=-2147483648 -g -fbacktrace -fimplicit-none -fcheck=all -ffpe-trap=invalid,zero,overflow    -std=f95 -o nodustvelocity.o -c nodustvelocity.f90
mpif90 -O -O0 -Wall -finit-real=NaN -finit-integer=-2147483648 -g -fbacktrace -fimplicit-none -fcheck=all -ffpe-trap=invalid,zero,overflow    -std=f95 -o magnetic.o -c magnetic.f90
mpif90 -O -O0 -Wall -finit-real=NaN -finit-integer=-2147483648 -g -fbacktrace -fimplicit-none -fcheck=all -ffpe-trap=invalid,zero,overflow    -std=f95 -o nodustdensity.o -c nodustdensity.f90
noentropy.f90:431.42:

    subroutine rprint_energy(lreset,lwrite)
                                          1
Warning: Unused dummy argument 'lwrite' at (1)
nodustdensity.f90:139.27:

      logical :: lreset,lwr
                           1
Warning: Unused variable 'lwr' declared at (1)
mpif90 -O -O0 -Wall -finit-real=NaN -finit-integer=-2147483648 -g -fbacktrace -fimplicit-none -fcheck=all -ffpe-trap=invalid,zero,overflow    -std=f95 -o nosolid_cells.o -c nosolid_cells.f90
magnetic.f90:8625.16:

            c = cos(omega_Bz_ext * t)
                1
Warning: Possible change of value in conversion from REAL(8) to REAL(4) at (1)
magnetic.f90:8626.16:

            s = sin(omega_Bz_ext * t)
                1
Warning: Possible change of value in conversion from REAL(8) to REAL(4) at (1)
magnetic.f90:8663.22:

          B_ext_out = B0_ext + 0.5 * (1.0 - cos(pi * (t - t0_bext) / (t_bext - 
                      1
Warning: Possible change of value in conversion from REAL(8) to REAL(4) at (1)
magnetic.f90:6873.27:

        f(l1:l2,m,n,iuu+0)=f(l1:l2,m,n,iuu+0)+ampl*fac/(4*kz)*sin(kz*z(n))
                           1
Warning: Possible change of value in conversion from COMPLEX(4) to REAL(4) at (1)
magnetic.f90:5444.21:

            taareset=t+daareset
                     1
Warning: Possible change of value in conversion from REAL(8) to REAL(4) at (1)
magnetic.f90:2756.22:

          p%bb(:,1) = p%bb(:,1) + dipole_moment * 2*(c*costh(m) + s*sinth(m)*co
                      1
Warning: Possible change of value in conversion from REAL(8) to REAL(4) at (1)
magnetic.f90:2757.22:

          p%bb(:,2) = p%bb(:,2) + dipole_moment *   (c*sinth(m) - s*costh(m)*co
                      1
Warning: Possible change of value in conversion from REAL(8) to REAL(4) at (1)
magnetic.f90:2758.22:

          p%bb(:,3) = p%bb(:,3) + dipole_moment *   (             s*         si
                      1
Warning: Possible change of value in conversion from REAL(8) to REAL(4) at (1)
magnetic.f90:1494.23:

        clight2_zdep = ((xyz1(3)/(z(n1:n2)+xyz1(3)))**6 &
                       1
Warning: Possible change of value in conversion from REAL(8) to REAL(4) at (1)
magnetic.f90:8412.42:

   subroutine magnetic_after_timestep(f,df,dtsub)
                                          1
Warning: Unused dummy argument 'df' at (1)
magnetic.f90:8412.48:

   subroutine magnetic_after_timestep(f,df,dtsub)
                                                1
Warning: Unused dummy argument 'dtsub' at (1)
magnetic.f90:3256.61:

      real, dimension (nx,3) :: magfric,vmagfric2, baroclinic
                                                             1
Warning: Unused variable 'baroclinic' declared at (1)
magnetic.f90:8544:0: warning: ‘get_resistivity_implicit’ defined but not used [-Wunused-function]
     subroutine get_resistivity_implicit(ndc, diffus_coeff, iz)
 ^
magnetic.f90:5517:0: warning: ‘curflux_ds’ defined but not used [-Wunused-function]
     subroutine curflux_dS(uxb,jj)
 ^
mpif90 -O -O0 -Wall -finit-real=NaN -finit-integer=-2147483648 -g -fbacktrace -fimplicit-none -fcheck=all -ffpe-trap=invalid,zero,overflow    -std=f95 -o hydro_kinematic.o -c hydro_kinematic.f90
ar r magnetic.a magnetic.o magnetic/nomeanfield.o magnetic/nomeanfield_demfdt.o
ar: creating magnetic.a
hydro.h:24.22:
    Included at hydro_kinematic.f90:33:

  public :: calc_gradu
                      1
Error: Symbol 'calc_gradu' at (1) has no IMPLICIT type
hydro_kinematic.f90:2794.16:

        tsforce=t+dtforce
                1
Warning: Possible change of value in conversion from REAL(8) to REAL(4) at (1)
hydro_kinematic.f90:488.20:

          p%uu(:,1)=ampl_kinflow*cos(omega_kinflow*t)*exp(eps_kinflow*t)
                    1
Warning: Possible change of value in conversion from REAL(8) to REAL(4) at (1)
hydro_kinematic.f90:503.20:

          p%uu(:,1)=ampl_kinflow_x*cos(omega_kinflow*t)*exp(eps_kinflow*t)
                    1
Warning: Possible change of value in conversion from REAL(8) to REAL(4) at (1)
hydro_kinematic.f90:504.20:

          p%uu(:,2)=ampl_kinflow_y*cos(omega_kinflow*t)*exp(eps_kinflow*t)
                    1
Warning: Possible change of value in conversion from REAL(8) to REAL(4) at (1)
hydro_kinematic.f90:505.20:

          p%uu(:,3)=ampl_kinflow_z*cos(omega_kinflow*t)*exp(eps_kinflow*t)
                    1
Warning: Possible change of value in conversion from REAL(8) to REAL(4) at (1)
hydro_kinematic.f90:820.15:

          eps1=(1.-eps_kinflow)*cos(omega_kinflow*t)
               1
Warning: Possible change of value in conversion from REAL(8) to REAL(4) at (1)
hydro_kinematic.f90:836.15:

          eps1=(1.-eps_kinflow)*cos(omega_kinflow*t)
               1
Warning: Possible change of value in conversion from REAL(8) to REAL(4) at (1)
hydro_kinematic.f90:852.17:

        kx_uukin=ky_uukin*(mod(.5-eps_kinflow*t,1.D0)-.5)
                 1
Warning: Possible change of value in conversion from REAL(8) to REAL(4) at (1)
hydro_kinematic.f90:854.13:

        eps1=cos(omega_kinflow*t)
             1
Warning: Possible change of value in conversion from REAL(8) to REAL(4) at (1)
hydro_kinematic.f90:872.17:

        kx_uukin=ky_uukin*(mod(.5-eps_kinflow*t,1.D0)-.5)
                 1
Warning: Possible change of value in conversion from REAL(8) to REAL(4) at (1)
hydro_kinematic.f90:874.13:

        eps1=cos(omega_kinflow*t)
             1
Warning: Possible change of value in conversion from REAL(8) to REAL(4) at (1)
hydro_kinematic.f90:909.13:

        eps1=ampl_kinflow*eps_kinflow*cos(omega_kinflow*t)
             1
Warning: Possible change of value in conversion from REAL(8) to REAL(4) at (1)
hydro_kinematic.f90:1027.14:

        ecost=eps_kinflow*cos(omega_kinflow*t)
              1
Warning: Possible change of value in conversion from REAL(8) to REAL(4) at (1)
hydro_kinematic.f90:1028.14:

        esint=eps_kinflow*sin(omega_kinflow*t)
              1
Warning: Possible change of value in conversion from REAL(8) to REAL(4) at (1)
hydro_kinematic.f90:1048.14:

        ecost=eps_kinflow*cos(omega_kinflow*t)
              1
Warning: Possible change of value in conversion from REAL(8) to REAL(4) at (1)
hydro_kinematic.f90:1049.14:

        esint=eps_kinflow*sin(omega_kinflow*t)
              1
Warning: Possible change of value in conversion from REAL(8) to REAL(4) at (1)
hydro_kinematic.f90:1066.14:

        sin2t=sin(omega_kinflow*t)**2
              1
Warning: Possible change of value in conversion from REAL(8) to REAL(4) at (1)
hydro_kinematic.f90:1067.14:

        cos2t=cos(omega_kinflow*t)**2
              1
Warning: Possible change of value in conversion from REAL(8) to REAL(4) at (1)
hydro_kinematic.f90:1085.13:

        epst=eps_kinflow*t
             1
Warning: Possible change of value in conversion from REAL(8) to REAL(4) at (1)
hydro_kinematic.f90:1104.13:

        epst=eps_kinflow*t
             1
Warning: Possible change of value in conversion from REAL(8) to REAL(4) at (1)
hydro_kinematic.f90:1213.25:

          tphase_kinflow=t+dtphase_kinflow
                         1
Warning: Possible change of value in conversion from REAL(8) to REAL(4) at (1)
hydro_kinematic.f90:1217.14:

        ecost=eps_kinflow*cos(omega_kinflow*t+phase1)
              1
Warning: Possible change of value in conversion from REAL(8) to REAL(4) at (1)
hydro_kinematic.f90:1218.14:

        esint=eps_kinflow*sin(omega_kinflow*t+phase2)
              1
Warning: Possible change of value in conversion from REAL(8) to REAL(4) at (1)
hydro_kinematic.f90:1235.25:

          tphase_kinflow=t+dtphase_kinflow
                         1
Warning: Possible change of value in conversion from REAL(8) to REAL(4) at (1)
hydro_kinematic.f90:1253.14:

        ecost=eps_kinflow*cos(omega_kinflow*t)
              1
Warning: Possible change of value in conversion from REAL(8) to REAL(4) at (1)
hydro_kinematic.f90:1254.14:

        esint=eps_kinflow*sin(omega_kinflow*t)
              1
Warning: Possible change of value in conversion from REAL(8) to REAL(4) at (1)
hydro_kinematic.f90:1271.12:

        cxt=cx_uukin*t
            1
Warning: Possible change of value in conversion from REAL(8) to REAL(4) at (1)
hydro_kinematic.f90:1272.12:

        cyt=cy_uukin*t
            1
Warning: Possible change of value in conversion from REAL(8) to REAL(4) at (1)
hydro_kinematic.f90:1273.12:

        czt=cz_uukin*t
            1
Warning: Possible change of value in conversion from REAL(8) to REAL(4) at (1)
hydro_kinematic.f90:1297.12:

        cxt=cx_uukin*t
            1
Warning: Possible change of value in conversion from REAL(8) to REAL(4) at (1)
hydro_kinematic.f90:1298.12:

        cyt=cy_uukin*t
            1
Warning: Possible change of value in conversion from REAL(8) to REAL(4) at (1)
hydro_kinematic.f90:1299.12:

        czt=cz_uukin*t
            1
Warning: Possible change of value in conversion from REAL(8) to REAL(4) at (1)
hydro_kinematic.f90:1336.12:

        omt=omega_kinflow*t
            1
Warning: Possible change of value in conversion from REAL(8) to REAL(4) at (1)
hydro_kinematic.f90:1430.17:

        kx_uukin=-ky_uukin*Sshear*t
                 1
Warning: Possible change of value in conversion from REAL(8) to REAL(4) at (1)
hydro_kinematic.f90:1446.17:

        kx_uukin=-ky_uukin*Sshear*t
                 1
Warning: Possible change of value in conversion from REAL(8) to REAL(4) at (1)
hydro_kinematic.f90:1807.18:

          kdotxwt=KS_k(1,modeN)*x(l1:l2)+(KS_k(2,modeN)*y(m)+KS_k(3,modeN)*z(n)
                  1
Warning: Possible change of value in conversion from REAL(8) to REAL(4) at (1)
hydro_kinematic.f90:1840.22:

          p%uu(:,1:2)=f(l1:l2,m,n,iux:iuz)*sin(omega_kinflow*t)
                      1
Warning: Possible change of value in conversion from REAL(8) to REAL(4) at (1)
make[2]: *** [hydro_kinematic.o] Error 1
make[2]: Leaving directory `/home/pencil/daily-test/samples/kin-dynamo/src'
make[1]: *** [code] Error 2
make[1]: Leaving directory `/home/pencil/daily-test/samples/kin-dynamo/src'
make: *** [default_to_be] Error 2
'make -j FFLAGS_DOUBLE=-fdefault-real-8 -fdefault-double-8 CFLAGS_DOUBLE=-DDOUBLE_PRECISION LD_MPI= CFLAGS_FFTW3= FFLAGS_FFTW3= LD_FFTW3= CFLAGS_FFTW2= FFLAGS_FFTW2= LD_FFTW2= FC=mpif90 F77=mpif77 FFLAGS=-O -O0 -Wall -finit-real=NaN -finit-integer=-2147483648 -g -fbacktrace -fimplicit-none -fcheck=all -ffpe-trap=invalid,zero,overflow LDFLAGS_HELPER=-dynamic FSTD_95=-std=f95 FSTD_2003=-std=f2003 CC=mpicc CFLAGS=-DFUNDERSC=1 default_to_be' failed: <> ['\nice -n 15 pc_build --config-files=GNU-GCC_MPI+GNU-GCC_debug ' reported: ]

daily-test/samples/meissner: (25/69)
    Compiling..            [double]           ok        01:19
    Starting..                                ok        00:00
    Running..                                 ok        00:25
    Validating results..                      ok      
    Time used:                                        01:44 = 01:19 + 00:25

daily-test/samples/conv-slab-noequi: (26/69)
    Compiling..                               ok        01:11
    Starting..                                ok        00:00
    Running..                                 ok        00:35
    Validating results..                      ok      
    Time used:                                        01:47 = 01:11 + 00:36

daily-test/samples/conv-slab: (27/69)
    Compiling..            [double]           ok        01:16
    Starting..                                ok        00:01
    Running..                                 ok        00:49
    Validating results..                      ok      
    Time used:                                        02:08 = 01:16 + 00:51

daily-test/samples/corona: (28/69)
    Compiling..                               ok        01:29
    Starting..                                ok        00:02
    Running..                                 ok        02:14
    Validating results..                      ok      
    Time used:                                        03:46 = 01:29 + 02:16

daily-test/samples/2d-tests/globaldisc: (29/69)
    Compiling..                               ok        00:55
    Starting..                                ok        00:00
    Running..                                 ok        00:40
    Validating results..                      ok      
    Time used:                                        01:36 = 00:55 + 00:41

daily-test/samples/2d-tests/cylindrical_gdisk: (30/69)
    Compiling..                               ok        00:53
    Starting..                                ok        00:00
    Running..                                 ok        00:00
    Validating results..                      ok      
    Time used:                                        00:54 = 00:53 + 00:00

daily-test/samples/spherical-globaldisk: (31/69)
    Compiling..                               ok        01:17
    Starting..                                ok        00:01
    Running..                                 ok        00:02
    Validating results..                      ok      
    Time used:                                        01:21 = 01:17 + 00:03

daily-test/samples/spherical-globaldisk-mhd: (32/69)
    Compiling..                               ok        01:19
    Starting..                                ok        00:01
    Running..                                 ok        00:05
    Validating results..                      ok      
    Time used:                                        01:26 = 01:19 + 00:06

daily-test/samples/spherical-gdisk-planet-thermo: (33/69)
    Compiling..                               ok        01:19
    Starting..                                ok        00:01
    Running..                                 ok        00:39
    Validating results..                      ok      
    Time used:                                        02:00 = 01:19 + 00:40

daily-test/samples/0d-tests/solar_system: (34/69)
    Compiling..                               ok        01:03
    Starting..                                ok        00:01
    Running..                                 ok        00:02
    Validating results..                      ok      
    Time used:                                        01:07 = 01:03 + 00:03

daily-test/samples/mdwarf: (35/69)
    Compiling..                               ok        01:18
    Starting..                                ok        00:00
    Running..                                 ok        01:04
    Validating results..                      ok      
    Time used:                                        02:22 = 01:18 + 01:04

daily-test/samples/sedimentation: (36/69)
    Compiling..                               ok        01:32
    Starting..                                ok        00:03
    Running..                                 ok        01:46
    Validating results..                      ok      
    Time used:                                        03:22 = 01:32 + 01:49

daily-test/samples/MRI-turbulence_hyper: (37/69)
    Compiling..            [double]           ok        01:24
    Starting..                                ok        00:01
    Running..                                 ok        00:48
    Validating results..                      ok      
    Time used:                                        02:14 = 01:24 + 00:49

daily-test/samples/dust_turb_globaldisk: (38/69)
    Compiling..                               ok        01:30
    Starting..                                ok        00:01
    Running..                                 ok        03:01
    Validating results..                      ok      
    Time used:                                        04:33 = 01:30 + 03:02

daily-test/samples/geodynamo: (39/69)
    Compiling..                               ok        01:23
    Starting..                                ok        00:01
    Running..                                 ok        03:50
    Validating results..                      ok      
    Time used:                                        05:15 = 01:23 + 03:52

daily-test/samples/2d-tests/cylinder_deposition: (40/69)
    Compiling..                               ok        01:09
    Starting..                                ok        00:00
    Running..                                 ok        00:09
    Validating results..                      ok      
    Time used:                                        01:19 = 01:09 + 00:09

daily-test/samples/2d-tests/selfgravdisk-deadzone-dust: (41/69)
    Compiling..                               ok        01:14
    Starting..                                ok        00:01
    Running..                                 ok        00:22
    Validating results..                      ok      
    Time used:                                        01:39 = 01:14 + 00:24

daily-test/samples/2d-tests/spherical_viscous_ring: (42/69)
    Compiling..                               ok        00:53
    Starting..                                ok        00:00
    Running..                                 ok        00:03
    Validating results..                      ok      
    Time used:                                        00:56 = 00:53 + 00:03

daily-test/samples/2d-tests/field-loop-fargo: (43/69)
    Compiling..                               ok        01:09
    Starting..                                ok        00:01
    Running..                                 ok        00:07
    Validating results..                      ok      
    Time used:                                        01:18 = 01:09 + 00:09

daily-test/samples/baroclinic: (44/69)
    Compiling..                               ok        01:22
    Starting..                                ok        00:01
    Running..                                 ok        01:12
    Validating results..                      ok      
    Time used:                                        02:36 = 01:22 + 01:13

daily-test/samples/1d-tests/sedimentation-noneq-blocks: (45/69)
    Compiling..                               ok        01:08
    Starting..                                ok        00:01
    Running..                                 ok        00:07
    Validating results..                      ok      
    Time used:                                        01:17 = 01:08 + 00:08

daily-test/samples/1d-tests/alphadisk: (46/69)
    Compiling..                               ok        00:47
    Starting..                                ok        00:02
    Running..                                 ok        00:19
    Validating results..                      ok      
    Time used:                                        01:10 = 00:47 + 00:22

daily-test/samples/implicit_resistivity: (47/69)
    Compiling..                               ok        01:11
    Starting..                                ok        00:00
    Running..                                 ok        00:16
    Validating results..                      ok      
    Time used:                                        01:28 = 01:11 + 00:17

daily-test/samples/debris-photoelectric-fluid: (48/69)
    Compiling..                               ok        01:15
    Starting..                                ok        00:00
    Running..                                 ok        00:07
    Validating results..                     
----------------------------------------------------------------------
### auto-test failed ###
Failed 4 test(s) out of 69:
CPU time (including compilation): 01:14:46u 04:06s
Total wall-clock time:            01:22:57 = 54:41 + 27:28

----------------------------------------------------------------------
The following configuration has been used:
$config = {
            'runtime' => {
                           'mpiexec_opts' => '',
                           'mpiexec_opts2' => '',
                           'mpiexec' => 'mpiexec'
                         },
            'makefile' => {
                            'FFLAGS_FFTW3' => '',
                            'FFLAGS_DOUBLE' => '-fdefault-real-8 -fdefault-double-8',
                            'CC' => 'mpicc',
                            'LD_MPI' => '',
                            'LDFLAGS_HELPER' => '-dynamic',
                            'FSTD_95' => '-std=f95',
                            'FFLAGS' => '-O -O0 -Wall -finit-real=NaN -finit-integer=-2147483648 -g -fbacktrace -fimplicit-none -fcheck=all -ffpe-trap=invalid,zero,overflow',
                            'F77' => 'mpif77',
                            'FSTD_2003' => '-std=f2003',
                            'CFLAGS' => '-DFUNDERSC=1',
                            'MAKE_VAR1' => '-j',
                            'FFLAGS_FFTW2' => '',
                            'CFLAGS_DOUBLE' => '-DDOUBLE_PRECISION',
                            'LD_FFTW3' => '',
                            'CFLAGS_FFTW2' => '',
                            'CFLAGS_FFTW3' => '',
                            'FC' => 'mpif90',
                            'LD_FFTW2' => ''
                          },
            'environment' => {
                               'MODULE_INFIX' => '_MOD_',
                               'MODULE_PREFIX' => '__',
                               'MODULE_SUFFIX' => ''
                             }
          };
Perl version v5.18.2
Mon Jul 24 01:36:04 2017